{"text_format":"3","workbook":"xlsx","n_sheets":6,"sheets":["Std Curve Instructions","Lab Std Curves","Initial Calibrators","IPR","Test Samples (AB Format)","TestSamples(SmartCyclerFormat)"],"not_rendered":{"images":1},"read":"whole","date_system":"1900"}

{"sheet":"Std Curve Instructions","index":0,"n_rows":79,"n_cols":32,"rows_kept":79}
[null,null,"Laboratory Prepared Standard Curves"]
[null,null,"Only populate cells highlighted in yellow."]
[null,null,"*Replace indicated Sequences values in column C with your own values if necessary",{"$nulls":15},"Individual Run",{"$nulls":5},"Composite"]
["Run","Information ","*Sequences","Log Sequences","CT","1- h_ii","res","rss_i","sigma_i","r_student","outlier",null,"Log Sequences","CT","res","res1","*res2",null,"Parameter","estimate","std.","95% LB","95% UB",null,"Parameter","estimate","std.","95% LB","95% UB"]
[1,null,{"v":22698.648518838218,"d":"22698.65"},4.356,22.645103454589844,0.7803499986184514,0.5551185141789219,3.863131854299135,0.5673866887096735,1.107546202550918,"No",null,4.356,22.645103454589844,0.31543154472821655,0.35420933174612657,0.3342177969375282,null,"slope",-3.5132331627049034,0.09727935201632275,-3.725186662939782,-3.3012796624700247,null,"slope",-3.4931529475175918,0.05145571956456948,-3.598731363167627,-3.3875745318675565]
[null,null,{"v":22698.648518838218,"d":"22698.65"},4.356,22.328855514526367,0.7803499986184514,0.23887057411544532,4.18490722951605,0.5905440450350317,0.45789472653705227,"No",null,4.356,22.328855514526367,-8.1639533526001173E-4,0.03796139168265,0.017969856874051615,null,"intercept",37.594537779586275,0.27040362734334483,37.00537888714204,38.183696672030514,null,"intercept",37.545846149248256,0.1442070022451754,37.249957821351465,37.841734477145046]
[null,null,{"v":22698.648518838218,"d":"22698.65"},4.356,21.719789505004883,0.7803499986184514,-0.37019543540603905,4.082407698076526,0.5832672127819094,-0.7184867747099848,"No",null,4.356,21.719789505004883,-0.6098824048567444,-0.5711046178388344,-0.5910961526474328]
[null,null,{"v":2404.3628000069343,"d":"2404.36"},3.3810000000000002,24.243507385253906,0.9015344238990726,-1.3277700468535691,2.302501963224765,0.43803557344360033,-3.192436947498778,"Yes",null," "," "," "," "," ",null,"R^2 =",0.9908834355724372,{"$nulls":4},"R^2 =",0.9941754962753645]
[null,null,{"v":2404.3628000069343,"d":"2404.36"},3.3810000000000002,25.807815551757812,0.9015344238990726,0.2365381196503371,4.195966006329252,0.5913237978136606,0.42129337078948986,"No",null,3.3810000000000002,25.807815551757812,0.07231951806653569,0.09151909527681568,0.08684699740183355]
[null,null,{"v":2404.3628000069343,"d":"2404.36"},3.3810000000000002,25.9750919342041,0.9015344238990726,0.40381450209662617,4.077150942570999,0.5828915667150995,0.7296305040031356,"No",null,3.3810000000000002,25.9750919342041,0.23959590051282476,0.25879547772310474,0.2541233798481226]
{"$rows_left_out":70}
{"sheet":"Lab Std Curves","index":1,"n_rows":154,"n_cols":32,"rows_kept":154}
[null,null,"Laboratory Prepared Standard Curves"]
[null,null,"Only populate cells highlighted in yellow."]
[null,null,"*replace indicated Sequences values in column C with your own values if necessary",{"$nulls":15},"Individual Run",{"$nulls":5},"Composite"]
["Run","Information ","*Sequences","Log Sequences","CT","1- h_ii","res","rss_i","sigma_i","r_student","outlier",null,"Log Sequences","CT","res","res1","*res2",null,"Parameter","estimate","std.","95% LB","95% UB",null,"Parameter","estimate","std.","95% LB","95% UB"]
[1,null,{"v":22698.648518838218,"d":"22698.65"},{"$f":"IF(E5=\" \",\" \",LOG10(C5))","v":" "},{"$f":"\" \"","v":" "},{"$f":" IF(E5=\" \",\" \",1- ( (1/COUNT(D$5:D$19)) + ((D5-AVERAGE(D$5:D$19))^2/DEVSQ(D$5:D$19))))","v":" "},{"$f":"IF(F5=\" \",\" \",E5-(INTERCEPT(E$5:E$19,D$5:D$19) + SLOPE(E$5:E$19,D$5:D$19)*D5))","v":" "},{"$f":"IF(G5=\" \",\" \",DEVSQ(G$5:G$19) -(G5^2/F5))","v":" "},{"$f":"IF(H5=\" \",\" \",SQRT(H5/(COUNT(D$5:D$19)-3)))","v":" "},{"$f":"IF(I5=\" \", \" \",G5/(I5*SQRT(F5)))","v":" "},{"$f":"IF(J5=\" \",\" \",IF(ABS(J5)>3,\"Yes\",\"No\"))","v":" "},null,{"$f":"IF(K5=\"No\",D5,\" \")","v":" "},{"$f":"IF(K5=\"No\",E5,\" \")","v":" "},{"$f":"IF(N5=\" \",\" \",N5-(INTERCEPT(N$5:N$154,M$5:M$154) + SLOPE(N$5:N$154,M$5:M$154)*M5))","v":" "},{"$f":"IF(N5=\" \",\" \",N5-(INTERCEPT($N$5:N$19,M$5:M$19) + SLOPE(N$5:N$19,M$5:M$19)*M5))","v":" "},{"$f":"IF(N5= \" \", \" \",N5 -(SUM(N$5:N$154)-AA$13)/AB$13 -IF(COUNT($N$5:$N$19)=0,\" \",(SUMPRODUCT($M$5:$M$19,$N$5:$N$19) -(SUM(N$5:N$154)-AA$13)/AB$13*SUM($M$5:$M$19))/SUMSQ($M$5:$M$19))*M5)","v":" "},null,"slope",{"$f":"SLOPE($N$5:$N$19,$M$5:$M$19)","v":{"$error":"#DIV/0!"}},{"$f":"SQRT((SUMSQ($P$5:$P$19)/(COUNT($P$5:$P$19)-2))/DEVSQ($M$5:$M$19))","v":{"$error":"#NUM!"}},{"$f":"$T$5- TINV(0.05,COUNT($O$5:$O$19)-2)*$U$5","v":{"$error":"#DIV/0!"}},{"$f":"$T$5 + TINV(0.05,COUNT($O$5:$O$19)-2)*$U$5","v":{"$error":"#DIV/0!"}},null,"slope",{"$f":"SLOPE($N$5:$N$154,$M$5:$M$154)","v":{"$error":"#DIV/0!"}},{"$f":"SQRT((SUMSQ($O$5:$O$154)/(COUNT($O$5:$O$154)-2))/DEVSQ($M$5:$M$154))","v":{"$error":"#NUM!"}},{"$f":"$Z$5- TINV(0.05,COUNT($O$5:$O$154)-2)*$AA$5","v":{"$error":"#DIV/0!"}},{"$f":" $Z$5 + TINV(0.05,COUNT($O$5:$O$154)-2)*$AA$5","v":{"$error":"#DIV/0!"}}]
[null,null,{"v":22698.648518838218,"d":"22698.65"},{"$f":"IF(E6=\" \",\" \",LOG10(C6))","v":" "}," ",{"$f":" IF(E6=\" \",\" \",1- ( (1/COUNT(D$5:D$19)) + ((D6-AVERAGE(D$5:D$19))^2/DEVSQ(D$5:D$19))))","v":" "},{"$f":"IF(F6=\" \",\" \",E6-(INTERCEPT(E$5:E$19,D$5:D$19) + SLOPE(E$5:E$19,D$5:D$19)*D6))","v":" "},{"$f":"IF(G6=\" \",\" \",DEVSQ(G$5:G$19) -(G6^2/F6))","v":" "},{"$f":"IF(H6=\" \",\" \",SQRT(H6/(COUNT(D$5:D$19)-3)))","v":" "}," ",{"$f":"IF(J6=\" \",\" \",IF(ABS(J6)>3,\"Yes\",\"No\"))","v":" "},null,{"$f":"IF(K6=\"No\",D6,\" \")","v":" "},{"$f":"IF(K6=\"No\",E6,\" \")","v":" "},{"$f":"IF(N6=\" \",\" \",N6-(INTERCEPT(N$5:N$154,M$5:M$154) + SLOPE(N$5:N$154,M$5:M$154)*M6))","v":" "},{"$f":"IF(N6=\" \",\" \",N6-(INTERCEPT(N$5:N$19,M$5:M$19) + SLOPE(N$5:N$19,M$5:M$19)*M6))","v":" "}," ",null,"intercept",{"$f":"INTERCEPT($N$5:$N$19,$M$5:$M$19)","v":{"$error":"#DIV/0!"}},{"$f":"SQRT((SUMSQ($P$5:$P$19)/(COUNT($P$5:$P$19)-2))*((1/COUNT($P$5:$P$19))+(AVERAGE($M$5:$M$19)^2/DEVSQ($M$5:$M$19))))","v":{"$error":"#DIV/0!"}},{"$f":"T$6- TINV(0.05,COUNT(O$5:O$19)-2)*U$6","v":{"$error":"#DIV/0!"}},{"$f":"$T$6 + TINV(0.05,COUNT($O$5:$O$19)-2)*$U$6","v":{"$error":"#DIV/0!"}},null,"intercept",{"$f":"INTERCEPT($N$5:$N$154,$M$5:$M$154)","v":{"$error":"#DIV/0!"}},{"$f":"SQRT((SUMSQ($O$5:$O$154)/(COUNT($O$5:$O$154)-2))*((1/COUNT($O$5:$O$154))+(AVERAGE($M$5:$M$154)^2/DEVSQ($M$5:$M$154))))","v":{"$error":"#DIV/0!"}},{"$f":"$Z$6- TINV(0.05,COUNT($O$5:$O$154)-2)*$AA$6","v":{"$error":"#DIV/0!"}},{"$f":"$Z$6 + TINV(0.05,COUNT($O$5:$O$154)-2)*$AA$6","v":{"$error":"#DIV/0!"}}]
[null,null,{"v":22698.648518838218,"d":"22698.65"}," "," "," "," "," "," "," "," ",null," "," "," "," "," "]
[null,null,{"v":2404.3628000069343,"d":"2404.36"}," "," "," "," "," "," "," "," ",null," "," "," "," "," ",null,"R^2 =",{"$f":"1-(SUMSQ($P$5:$P$19)/DEVSQ($N$5:$N$19))","v":{"$error":"#NUM!"}},{"$nulls":4},"R^2 =",{"$f":"1-(SUMSQ($O$5:$O$154)/DEVSQ($N$5:$N$154))","v":{"$error":"#NUM!"}}]
[null,null,{"v":2404.3628000069343,"d":"2404.36"}," "," "," "," "," "," "," "," ",null," "," "," "," "," "]
[null,null,{"v":2404.3628000069343,"d":"2404.36"}," "," "," "," "," "," "," "," ",null," "," "," "," "," "]
{"$rows_left_out":145}
{"sheet":"Initial Calibrators","index":2,"n_rows":84,"n_cols":13,"rows_kept":84,"merged":[[0,6,0,8],[62,8,63,12],[64,0,65,1],[66,8,67,12]]}
[{"$nulls":3},"Laboratory-Prepared Calibrators ",null,null,"Only populate cells highlighted in yellow."]
[null,null,"*In C4, enter 1 if undiluted extracts, enter 5 if 5-fold diluted extracts, enter 25 if 25-fold diluted extracts (all dilutions must be the same)"]
["Run","Information ","*Extract Dilution","Calibrator ID","Entero CT","Sketa (SPC) CT","mean dCT",null,"*Estimated cells/ml in stock suspension:",{"$nulls":3},"* In L3 enter 1e6 (CFU/ml in lab-prepared substocks if using standard dilution protocol in Section 11.1.8 of Method), or enter CFU/Bioball from certificate of analysis"]
[1,null,1,"Calib 1",null,null,{"$f":"IF(E4=\"\",\"\",(AVERAGE(E4:E5))-(AVERAGE(F4:F5)))","v":""},null,"**Dilution factor to prepare calibrator sample inoculum",{"$nulls":3},"** In L4 enter 100 (if using standard dilution protocol for lab-prepared substocks in Section 11.3.3 of Method), or enter 1 if using Bioballs"]
[{"$nulls":8},"Estimated cells/calibrator sample :",null,null,{"$f":"L3/L4","v":{"$error":"#DIV/0!"}}]
[{"$nulls":3},"Calib 2",null,null,{"$f":"IF(E6=\"\",\"\",(AVERAGE(E6:E7))-(AVERAGE(F6:F7)))","v":""}]
[{"$nulls":8},"Intercept value (from Lab Std Curves sheet):",null,null,{"$f":"'Lab Std Curves'!Z6","v":{"$error":"#DIV/0!"}}]
[{"$nulls":3},"Calib 3",null,null,{"$f":"IF(E8=\"\",\"\",(AVERAGE(E8:E9))-(AVERAGE(F8:F9)))","v":""},null,"Slope value (from Lab Std Curves sheet):",null,null,{"$f":"'Lab Std Curves'!Z5","v":{"$error":"#DIV/0!"}}]
[]
[2,null,null,"Calib 1",null,null,{"$f":"IF(E10=\"\",\"\",(AVERAGE(E10:E11))-(AVERAGE(F10:F11)))","v":""}]
{"$rows_left_out":75}
{"sheet":"IPR","index":3,"n_rows":53,"n_cols":13,"rows_kept":53,"merged":[[17,8,18,8],[17,9,18,9],[17,10,18,10],[41,8,42,8],[41,9,42,9],[41,10,42,10],[41,11,42,11],[41,12,42,12]]}
[{"$nulls":3},"Laboratory ddCT - Initial Precision and Recovery of Reference Matrix Spike Samples"]
["Only populate/modify cells highlighted in yellow."]
["Dilutions must be same as for initial calibrators","*If the IAC assay is not performed, enter zeros \"0\" in all cells of this spreadsheet where Entero and Sketa Ct values have been entered in the same row"]
[]
["Positive Controls","Entero CT","*IAC CT","Sketa CT","Entero QC","SPC QC","Calib dCT"]
["Calibrator 1",{"$nulls":3},{"$f":"IF(OR(B6<('Initial Calibrators'!E$65-(3*'Initial Calibrators'!E$66)),B6>('Initial Calibrators'!E$65+(3*'Initial Calibrators'!E$66))),\"fail\",B6)","v":{"$error":"#DIV/0!"}},{"$f":"IF(OR(D6<('Initial Calibrators'!F$65-(3*'Initial Calibrators'!F$66)),D6>('Initial Calibrators'!F$65+(3*'Initial Calibrators'!F$66))),\"fail\",D6)","v":{"$error":"#DIV/0!"}}]
[{"$nulls":4},{"$f":"IF(OR(B7<('Initial Calibrators'!E$65-(3*'Initial Calibrators'!E$66)),B7>('Initial Calibrators'!E$65+(3*'Initial Calibrators'!E$66))),\"fail\",B7)","v":{"$error":"#DIV/0!"}},{"$f":"IF(OR(D7<('Initial Calibrators'!F$65-(3*'Initial Calibrators'!F$66)),D7>('Initial Calibrators'!F$65+(3*'Initial Calibrators'!F$66))),\"fail\",D7)","v":{"$error":"#DIV/0!"}}]
["Calibrator 2",{"$nulls":3},{"$f":"IF(OR(B8<('Initial Calibrators'!E$65-(3*'Initial Calibrators'!E$66)),B8>('Initial Calibrators'!E$65+(3*'Initial Calibrators'!E$66))),\"fail\",B8)","v":{"$error":"#DIV/0!"}},{"$f":"IF(OR(D8<('Initial Calibrators'!F$65-(3*'Initial Calibrators'!F$66)),D8>('Initial Calibrators'!F$65+(3*'Initial Calibrators'!F$66))),\"fail\",D8)","v":{"$error":"#DIV/0!"}}]
[{"$nulls":4},{"$f":"IF(OR(B9<('Initial Calibrators'!E$65-(3*'Initial Calibrators'!E$66)),B9>('Initial Calibrators'!E$65+(3*'Initial Calibrators'!E$66))),\"fail\",B9)","v":{"$error":"#DIV/0!"}},{"$f":"IF(OR(D9<('Initial Calibrators'!F$65-(3*'Initial Calibrators'!F$66)),D9>('Initial Calibrators'!F$65+(3*'Initial Calibrators'!F$66))),\"fail\",D9)","v":{"$error":"#DIV/0!"}}]
["Calibrator 3",{"$nulls":3},{"$f":"IF(OR(B10<('Initial Calibrators'!E$65-(3*'Initial Calibrators'!E$66)),B10>('Initial Calibrators'!E$65+(3*'Initial Calibrators'!E$66))),\"fail\",B10)","v":{"$error":"#DIV/0!"}},{"$f":"IF(OR(D10<('Initial Calibrators'!F$65-(3*'Initial Calibrators'!F$66)),D10>('Initial Calibrators'!F$65+(3*'Initial Calibrators'!F$66))),\"fail\",D10)","v":{"$error":"#DIV/0!"}}]
{"$rows_left_out":44}
{"sheet":"Test Samples (AB Format)","index":4,"n_rows":92,"n_cols":20,"rows_kept":92,"merged":[[0,0,0,12],[4,0,5,0],[15,16,28,16],[18,0,19,0],[23,14,28,14],[23,15,28,15],[23,17,28,17],[24,13,28,13],[28,0,29,0],[29,11,30,11],[29,12,30,12],[29,13,30,13],[29,14,30,14],[29,15,30,15],[29,16,30,16],[29,17,30,17],[67,18,70,19],[71,11,72,11],[71,12,72,12],[71,13,72,13],[71,14,72,14],[71,15,72,15],[71,16,72,16],[71,17,72,17],[71,18,72,18],[71,19,72,19]]}
["Laboratory ddCT - PBS and Water Matrix Samples"]
["Only populate/modify cells highlighted in yellow."]
["This row can be used to enter Sample Batch Information, e.g. date and location of samples, reagent lot #'s, etc."]
["Extract dilutions must be same as for initial calibrators","*If the IAC assay is not performed, enter zeros \"0\" in all cells of this spreadsheet where Entero and Sketa Ct values have been entered in the same row"]
["Positive Controls                           (same run as test samples)","**At least one of the calibrator Entero and SPC Ct measurements as well as the avg dCT value must pass QC for test sample calculations to be performed"]
[null,"Entero CT","*IAC CT","Sketa CT","Entero QC","Sketa QC","Calib dCT","**dCT QC"]
["Calibrator 1",{"$nulls":3},{"$f":"IF(OR(B7<('Initial Calibrators'!E$67),B7>('Initial Calibrators'!E$68)),\"\",B7)","v":{"$error":"#DIV/0!"}},{"$f":"IF(OR(D7<('Initial Calibrators'!F$67),D7>('Initial Calibrators'!F$68)),\"\",D7)","v":{"$error":"#DIV/0!"}}]
[{"$nulls":4},{"$f":"IF(OR(B8<('Initial Calibrators'!E$67),B8>('Initial Calibrators'!E$68)),\"\",B8)","v":{"$error":"#DIV/0!"}},{"$f":"IF(OR(D8<('Initial Calibrators'!F$67),D8>('Initial Calibrators'!F$68)),\"\",D8)","v":{"$error":"#DIV/0!"}}]
["Calibrator 2",{"$nulls":3},{"$f":"IF(OR(B9<('Initial Calibrators'!E$67),B9>('Initial Calibrators'!E$68)),\"\",B9)","v":{"$error":"#DIV/0!"}},{"$f":"IF(OR(D9<('Initial Calibrators'!F$67),D9>('Initial Calibrators'!F$68)),\"\",D9)","v":{"$error":"#DIV/0!"}}]
[{"$nulls":4},{"$f":"IF(OR(B10<('Initial Calibrators'!E$67),B10>('Initial Calibrators'!E$68)),\"\",B10)","v":{"$error":"#DIV/0!"}},{"$f":"IF(OR(D10<('Initial Calibrators'!F$67),D10>('Initial Calibrators'!F$68)),\"\",D10)","v":{"$error":"#DIV/0!"}}]
{"$rows_left_out":83}
{"sheet":"TestSamples(SmartCyclerFormat)","index":5,"n_rows":74,"n_cols":20,"rows_kept":74,"merged":[[0,0,0,12],[4,0,5,0],[16,16,28,16],[18,0,19,0],[23,14,28,14],[23,15,28,15],[23,17,28,17],[24,13,28,13],[28,0,29,0],[28,1,29,3],[29,11,30,11],[29,12,30,12],[29,13,30,13],[29,14,30,14],[29,15,30,15],[29,16,30,16],[29,17,30,17],[55,18,58,19],[59,11,60,11],[59,12,60,12],[59,13,60,13],[59,14,60,14],[59,15,60,15],[59,16,60,16],[59,17,60,17],[59,18,60,18],[59,19,60,19]]}
["Laboratory ddCT - PBS and Water Matrix Samples"]
["Only populate/modify cells highlighted in yellow."]
["This row can be used to enter Sample Batch Information, e.g. date and location of samples, reagent lot #'s, etc."]
["Extract dilutions must be same as for initial calibrators","*If the IAC assay is not performed, enter zeros \"0\" in all cells of this spreadsheet where Entero and Sketa Ct values have been entered in the same row"]
["Positive Controls                    (separate run from test samples)","**At least one of the calibrator Entero and SPC Ct measurements as well as the avg dCT value must pass QC for test sample calculations to be performed"]
[null,"Entero CT","*IAC CT","Sketa CT","Entero QC","Sketa QC","Calib dCT","**dCT QC"]
["Calibrator 1",{"$nulls":3},{"$f":"IF(OR(B7<('Initial Calibrators'!E$67),B7>('Initial Calibrators'!E$68)),\"\",B7)","v":{"$error":"#DIV/0!"}},{"$f":"IF(OR(D7<('Initial Calibrators'!F$67),D7>('Initial Calibrators'!F$68)),\"\",D7)","v":{"$error":"#DIV/0!"}}]
[{"$nulls":4},{"$f":"IF(OR(B8<('Initial Calibrators'!E$67),B8>('Initial Calibrators'!E$68)),\"\",B8)","v":{"$error":"#DIV/0!"}},{"$f":"IF(OR(D8<('Initial Calibrators'!F$67),D8>('Initial Calibrators'!F$68)),\"\",D8)","v":{"$error":"#DIV/0!"}}]
["Calibrator 2",{"$nulls":3},{"$f":"IF(OR(B9<('Initial Calibrators'!E$67),B9>('Initial Calibrators'!E$68)),\"\",B9)","v":{"$error":"#DIV/0!"}},{"$f":"IF(OR(D9<('Initial Calibrators'!F$67),D9>('Initial Calibrators'!F$68)),\"\",D9)","v":{"$error":"#DIV/0!"}}]
[{"$nulls":4},{"$f":"IF(OR(B10<('Initial Calibrators'!E$67),B10>('Initial Calibrators'!E$68)),\"\",B10)","v":{"$error":"#DIV/0!"}},{"$f":"IF(OR(D10<('Initial Calibrators'!F$67),D10>('Initial Calibrators'!F$68)),\"\",D10)","v":{"$error":"#DIV/0!"}}]
{"$rows_left_out":64}