{"text_format":"3","workbook":"xlsx","n_sheets":9,"sheets":["Cover Page","Net Worth Test","Instructions Net Worth","Cash Flow Test","Future Cash","Instructions Cash Flow","Debt Capacity Test","Penalty or Contribution Payment","Cushion"],"read":"whole","date_system":"1900"}

{"sheet":"Cover Page","index":0,"n_rows":1,"n_cols":1,"rows_kept":1,"merged":[[0,0,24,12]]}
["INDIPAY +                                                                                                                                                                                             FINANCIAL ANALYSIS SPREADSHEETS                                                                                                                                      \n                                                                                                                                                                                                                  U.S. Environmental Protection Agency\nOffice of Enforcement and Compliance\nOffice of Site Remediation Enforcement and Office of Civil Enforcement\n\nMay 2021\n"]

{"sheet":"Net Worth Test","index":1,"n_rows":89,"n_cols":6,"rows_kept":89,"merged":[[0,0,0,5],[1,0,1,3],[2,0,2,5],[3,0,4,2],[5,1,5,2],[14,1,14,2],[15,1,15,2],[27,1,27,2],[28,1,28,2],[47,1,47,2],[48,1,48,2],[54,1,54,2],[55,0,55,2],[56,0,56,5],[57,0,58,2],[59,1,59,2],[64,1,64,2],[65,1,65,2],[75,1,75,2],[76,1,76,2],[82,1,82,2],[83,0,83,2],[84,4,84,5]]}
["NET WORTH TEST (WORKSHEET)"]
["[Individual's Name]",{"$nulls":3},"[Prepared by:]","[Date]"]
[]
["ASSETS (end of the year)",null,null,"Actual ($)","Adjustments in Market Value ($)","Final Amount ($)"]
[{"$nulls":3},"(Primary and Secondary Sources)","(Tertiary/Third Sources)","(Cumulative of Column D and Column E)"]
[1,"CASH & CASH EQUIVALENTS:                "]
[null,null,"Cash On Hand",{"v":0,"d":"$0.00"},{"v":0,"d":"$0.00"},{"$f":"D7+E7","v":{"v":0,"d":"$0.00"}}]
[null,null,"Checking Account",{"v":0,"d":"$0.00"},{"v":0,"d":"$0.00"},{"$f":"D8+E8","v":{"v":0,"d":"$0.00"}}]
[null,null,"Saving Accounts",{"v":0,"d":"$0.00"},{"v":0,"d":"$0.00"},{"v":0,"d":"$0.00"}]
[null,null,"Money Market Funds",{"v":0,"d":"$0.00"},{"v":0,"d":"$0.00"},{"v":0,"d":"$0.00"}]
[null,null,"Life Insurance cash value",{"v":0,"d":"$0.00"},{"v":0,"d":"$0.00"},{"v":0,"d":"$0.00"}]
[null,null,"Other (e.g., CDs)",{"v":0,"d":"$0.00"},{"v":0,"d":"$0.00"},{"v":0,"d":"$0.00"}]
[null,null,"Other (e.g., commercial paper)",{"v":0,"d":"$0.00"},{"v":0,"d":"$0.00"},{"v":0,"d":"$0.00"}]
[null,null,"Other (e.g., coin collection)",{"v":0,"d":"$0.00"},{"v":0,"d":"$0.00"},{"v":0,"d":"$0.00"}]
[2,"Total Cash & Cash Equivalents",null,{"$f":"SUM(D7:D14)","v":{"v":0,"d":"$0.00"}},{"$f":"SUM(E7:E14)","v":{"v":0,"d":"$0.00"}},{"$f":"SUM(F7:F14)","v":{"v":0,"d":"$0.00"}}]
[3,"PERSONAL USE ASSETS:"]
[null,null,"Personal residence",{"v":0,"d":"$0.00"},{"v":0,"d":"$0.00"},{"$f":"D17+E17","v":{"v":0,"d":"$0.00"}}]
[null,null,"Home use assets (e.g. household goods)",{"v":0,"d":"$0.00"},{"v":0,"d":"$0.00"},{"$f":"D18+E18","v":{"v":0,"d":"$0.00"}}]
[null,null,"Auto",{"v":0,"d":"$0.00"},{"v":0,"d":"$0.00"},{"v":0,"d":"$0.00"}]
[null,null,"Recreational vehicle/boat",{"v":0,"d":"$0.00"},{"v":0,"d":"$0.00"},{"v":0,"d":"$0.00"}]
{"$rows_left_out":70}
{"sheet":"Instructions Net Worth","index":2,"n_rows":108,"n_cols":15,"rows_kept":108,"merged":[[0,0,0,14],[1,0,1,14],[3,1,3,2],[3,3,3,14],[4,1,4,14],[5,1,5,14],[6,1,6,2],[6,3,6,14],[8,1,8,2],[8,3,8,14],[9,1,9,14],[10,1,10,2],[10,3,10,14],[11,1,11,14],[12,1,12,14],[13,1,13,2],[13,3,13,14],[14,1,14,14],[15,1,15,2],[15,3,15,14],[16,1,16,14],[17,1,18,2],[17,3,18,14],[19,1,19,14],[20,0,20,14],[21,0,23,2],[21,3,21,8],[21,9,21,13],[22,4,22,7],[22,9,22,13],[24,1,24,2],[25,8,35,8],[25,14,35,14],[36,1,36,2],[37,1,37,2],[38,0,49,0],[38,1,49,1],[38,8,49,8],[38,14,49,14],[50,1,50,2],[51,1,51,2],[52,8,69,8],[52,14,69,14],[70,1,70,2],[71,1,71,2],[72,8,76,8],[72,14,76,14],[77,1,77,2],[78,0,78,2],[79,0,79,14],[80,0,82,2],[80,3,80,8],[80,9,80,13],[81,4,81,7],[81,9,81,13],[82,6,82,7],[83,1,83,2],[83,6,83,7],[84,6,84,7],[84,8,87,8],[84,14,87,14],[85,6,85,7],[86,6,86,7],[87,6,87,7],[88,1,88,2],[88,6,88,7],[89,1,89,2],[89,6,89,7],[90,6,90,7],[90,8,98,8],[90,14,98,14],[91,6,91,7],[92,6,92,7],[93,6,93,7],[94,6,94,7],[95,6,95,7],[96,6,96,7],[97,6,97,7],[98,6,98,7],[99,1,99,2],[99,6,99,7],[100,1,100,2],[100,6,100,7],[101,6,101,7],[101,8,105,8],[101,14,105,14],[102,6,102,7],[103,6,103,7],[104,6,104,7],[105,6,105,7],[107,0,107,2]]}
["INSTRUCTIONS - NET WORTH TEST "]
["User is advised but not required to obtain information/data on all assets and liabilities listed below.  To make a final determination on what information/data is needed is case specific.   "]
[]
[null,"INSTRUCTIONS:"]
[]
[null,"Where do I insert the data?"]
[{"$nulls":3}," White color columns/cells in the Net Worth Test's worksheet are working columns/cells where the user should insert the data/information on the individual."]
[null,"Where do I NOT have to fill the data?"]
[]
[null,"Blue color cells in the Net Worth Test's worksheet are auto-populating and auto-calculating cells.  "]
[]
[]
[null,"Where are the instructions to follow?"]
[{"$nulls":3},"Gray color columns are instructions for the user to follow."]
[null,"Where can I find the data?"]
[null,"ü",null,"Gray color boxes with the check mark mean the information is provided and/or available for that particular source."]
[null,"What changes do I have to consider/make?"]
[null,"Adjustments in Market Value (Tertiary Sources)*",null,"Assets and liabilities found in the Tertiary Source(s) should be adjusted to the current market value, as necessary, through the use of the tips provided in the Guide, Checklist, and Reference Manual.  If this valuation is impossible, obtain the value from the individual and/or insert the value that was found and include a footnote explaining the valuation for your record."]
[]
[]
{"$rows_left_out":89}
{"sheet":"Cash Flow Test","index":3,"n_rows":65,"n_cols":19,"rows_kept":65,"merged":[[0,0,0,17],[1,0,1,2],[1,3,1,13],[1,14,1,17],[2,0,3,2],[2,3,2,5],[2,6,2,8],[2,9,2,11],[2,12,2,14],[2,15,2,17],[4,0,4,2],[5,1,5,2],[11,1,11,2],[29,0,29,2],[31,0,31,2],[32,1,32,2],[53,1,53,2],[62,0,62,2],[64,0,64,2]]}
["CASH FLOW TEST (WORKSHEET)"]
["[ Individual's Name]",null,null,"[Prepared by:]",{"$nulls":10},"[Date]"]
["CURRENT CASH AVAILABLE                             (CASH POSITION)                                                      (at the end of the year                                 or annual amount)",null,null,"Year 5: (e.g. 2016)",null,null,"Year 4: (e.g. 2017)",null,null,"Year 3: (e.g. 2018)",null,null,"Year 2: (e.g. 2019)",null,null,"Year 1: (e.g. 2020)",null,null,"Average Cash"]
[{"$nulls":3},"Actual (Primary and Secondary Sources)","Adjustments in Market Value (Tertiary Sources)*","Final (Cumulative of Column J and Column K)","Actual (Primary and Secondary Sources)","Adjustments in Market Value (Tertiary Sources)*","Final (Cumulative of Column J and Column K)","Actual (Primary and Secondary Sources)","Adjustments in Market Value (Tertiary Sources)*","Final (Cumulative of Column J and Column K)","Actual (Primary and Secondary Sources)","Adjustments in Market Value (Tertiary Sources)*","Final (Cumulative of Column M and Column N)","Actual (Primary and Secondary Sources)","Adjustments in Market Value (Tertiary Sources)*","Final (Cumulative of Column P and Column Q)","(Weighted Average of Last Three years) "]
["\"CASH IN\"  (Cash Inflows) "]
[1,"CASH EQUIVALENTS "]
[null,null,"Saving Accounts (interest earned)",{"v":0,"d":"$0"},null,{"$f":"D7+E7","v":{"v":0,"d":"$0"}},{"v":0,"d":"$0"},null,{"$f":"G7+H7","v":{"v":0,"d":"$0"}},{"v":0,"d":"$0"},null,{"$f":"J7+K7","v":{"v":0,"d":"$0"}},{"v":0,"d":"$0"},null,{"$f":"M7+N7","v":{"v":0,"d":"$0"}},{"v":0,"d":"$0"},null,{"$f":"P7+Q7","v":{"v":0,"d":"$0"}},{"$f":"IF(SUM(F7,I7,L7)>0,SUM((L7*0.15),(O7*0.35),(R7*0.5)),IF(L7=0,IF(O7=0, R7*1,SUM((O7*0.4),(R7*0.6))),SUM((L7*0.15),(O7*0.35),(R7*0.5))))","v":{"v":0,"d":"$0"}}]
[null,null,"Money Market Funds interest earned)",{"v":0,"d":"$0"},null,{"v":0,"d":"$0"},{"v":0,"d":"$0"},null,{"v":0,"d":"$0"},{"v":0,"d":"$0"},null,{"v":0,"d":"$0"},{"v":0,"d":"$0"},null,{"v":0,"d":"$0"},{"v":0,"d":"$0"},null,{"$f":"P8+Q8","v":{"v":0,"d":"$0"}},{"$f":"IF(SUM(F8,I8,L8)>0,SUM((L8*0.15),(O8*0.35),(R8*0.5)),IF(L8=0,IF(O8=0, R8*1,SUM((O8*0.4),(R8*0.6))),SUM((L8*0.15),(O8*0.35),(R8*0.5))))","v":{"v":0,"d":"$0"}}]
[null,null,"Certificates of Deposit (interest earned)",{"v":0,"d":"$0"},null,{"v":0,"d":"$0"},{"v":0,"d":"$0"},null,{"v":0,"d":"$0"},{"v":0,"d":"$0"},null,{"v":0,"d":"$0"},{"v":0,"d":"$0"},null,{"v":0,"d":"$0"},{"v":0,"d":"$0"},null,{"v":0,"d":"$0"},{"v":0,"d":"$0"}]
[null,null,"Other (interest earned)",{"v":0,"d":"$0"},null,{"v":0,"d":"$0"},{"v":0,"d":"$0"},null,{"v":0,"d":"$0"},{"v":0,"d":"$0"},null,{"v":0,"d":"$0"},{"v":0,"d":"$0"},null,{"v":0,"d":"$0"},{"v":0,"d":"$0"},null,{"v":0,"d":"$0"},{"v":0,"d":"$0"}]
[2,null,"Total cash equivalents",{"$f":"SUM(D7:D10)","v":{"v":0,"d":"$0"}},{"v":0,"d":"$0"},{"v":0,"d":"$0"},{"v":0,"d":"$0"},{"v":0,"d":"$0"},{"v":0,"d":"$0"},{"v":0,"d":"$0"},{"v":0,"d":"$0"},{"v":0,"d":"$0"},{"v":0,"d":"$0"},{"v":0,"d":"$0"},{"v":0,"d":"$0"},{"v":0,"d":"$0"},{"v":0,"d":"$0"},{"v":0,"d":"$0"},{"v":0,"d":"$0"}]
[3,"CASH RECEIPTS"]
[null,null,"Income (salary, wages)",{"v":0,"d":"$0"},null,{"$f":"D13+E13","v":{"v":0,"d":"$0"}},{"v":0,"d":"$0"},null,{"$f":"G13+H13","v":{"v":0,"d":"$0"}},{"v":0,"d":"$0"},null,{"$f":"J13+K13","v":{"v":0,"d":"$0"}},{"v":0,"d":"$0"},null,{"$f":"M13+N13","v":{"v":0,"d":"$0"}},{"v":0,"d":"$0"},null,{"$f":"P13+Q13","v":{"v":0,"d":"$0"}},{"v":0,"d":"$0"}]
[null,null,"Income (dividends, interest) ",{"v":0,"d":"$0"},null,{"v":0,"d":"$0"},{"v":0,"d":"$0"},null,{"v":0,"d":"$0"},{"v":0,"d":"$0"},null,{"v":0,"d":"$0"},{"v":0,"d":"$0"},null,{"v":0,"d":"$0"},{"v":0,"d":"$0"},null,{"v":0,"d":"$0"},{"v":0,"d":"$0"}]
[null,null,"Income (received alimony and/or child support)",{"v":0,"d":"$0"},null,{"v":0,"d":"$0"},{"v":0,"d":"$0"},null,{"v":0,"d":"$0"},{"v":0,"d":"$0"},null,{"v":0,"d":"$0"},{"v":0,"d":"$0"},null,{"v":0,"d":"$0"},{"v":0,"d":"$0"},null,{"v":0,"d":"$0"},{"v":0,"d":"$0"}]
[null,null,"Loan",{"v":0,"d":"$0"},null,{"v":0,"d":"$0"},{"v":0,"d":"$0"},null,{"v":0,"d":"$0"},{"v":0,"d":"$0"},null,{"v":0,"d":"$0"},{"v":0,"d":"$0"},null,{"v":0,"d":"$0"},{"v":0,"d":"$0"},null,{"v":0,"d":"$0"},{"v":0,"d":"$0"}]
[null,null,"Other (trust income)",{"v":0,"d":"$0"},null,{"v":0,"d":"$0"},{"v":0,"d":"$0"},null,{"v":0,"d":"$0"},{"v":0,"d":"$0"},null,{"v":0,"d":"$0"},{"v":0,"d":"$0"},null,{"v":0,"d":"$0"},{"v":0,"d":"$0"},null,{"v":0,"d":"$0"},{"v":0,"d":"$0"}]
[null,null,"Other (IRA distributions, pensions, other retirement benefits)",{"v":0,"d":"$0"},null,{"v":0,"d":"$0"},{"v":0,"d":"$0"},null,{"v":0,"d":"$0"},{"v":0,"d":"$0"},null,{"v":0,"d":"$0"},{"v":0,"d":"$0"},null,{"v":0,"d":"$0"},{"v":0,"d":"$0"},null,{"v":0,"d":"$0"},{"v":0,"d":"$0"}]
[null,null,"Other (business income)",{"v":0,"d":"$0"},null,{"v":0,"d":"$0"},{"v":0,"d":"$0"},null,{"v":0,"d":"$0"},{"v":0,"d":"$0"},null,{"$f":"J19+K19","v":{"v":0,"d":"$0"}},{"v":0,"d":"$0"},null,{"$f":"M19+N19","v":{"v":0,"d":"$0"}},{"v":0,"d":"$0"},null,{"v":0,"d":"$0"},{"v":0,"d":"$0"}]
[null,null,"Other (rental income)",{"v":0,"d":"$0"},null,{"v":0,"d":"$0"},{"v":0,"d":"$0"},null,{"v":0,"d":"$0"},{"v":0,"d":"$0"},null,{"$f":"J20+K20","v":{"v":0,"d":"$0"}},{"v":0,"d":"$0"},null,{"$f":"M20+N20","v":{"v":0,"d":"$0"}},{"v":0,"d":"$0"},null,{"v":0,"d":"$0"},{"v":0,"d":"$0"}]
{"$rows_left_out":46}
{"sheet":"Future Cash","index":4,"n_rows":18,"n_cols":9,"rows_kept":18,"merged":[[0,0,0,8],[1,0,1,8],[2,0,2,3],[2,4,2,7],[3,0,3,8],[4,0,4,2],[10,0,10,8],[11,0,11,8],[17,0,17,2]]}
["FUTURE CASH FLOW (WORKSHEET)"]
["User is advised to ask for any possible income and expenses that the individual might receive/incur in the future that isn't accounted for in the current financial information obtained (e.g., future college expenses, pregnancy and childbirth, future income from a business as it transitions from startup to income-generating.)"]
["[Individual's name]",{"$nulls":3},"[Prepared by:]",{"$nulls":3},"[Date]"]
[]
["FUTURE CASH FLOW",null,null,"YEAR + 1","Year + 2","YEAR + 3","YEAR + 4","YEAR + 5 ","TOTAL AMOUNT"]
[null,null,"\"CASH IN\"/(Cash Inflows)"]
[null,null,"Future Income - one time cash inflow                         (e.g., cash received from settlement of owner's life insurance)",{"v":0,"d":"$0"},{"v":0,"d":"$0"},{"v":0,"d":"$0"},{"v":0,"d":"$0"},{"v":0,"d":"$0"},{"$f":"NPV('Penalty or Contribution Payment'!$C8,D7:H7)","v":{"v":0,"d":"$0"}}]
[null,null,"Future Income - series of cash inflows                          (e.g., receiving payouts from an annuity or a retirement fund)",{"v":0,"d":"$0"},{"v":0,"d":"$0"},{"v":0,"d":"$0"},{"v":0,"d":"$0"},{"v":0,"d":"$0"},{"$f":"NPV('Penalty or Contribution Payment'!$C8,D8:H8)","v":{"v":0,"d":"$0"}}]
[null,null,"Other Future Income - series of cash inflows           (e.g., receiving dividends/interest from a new/start-up business)",{"v":0,"d":"$0"},{"$f":"D9","v":{"v":0,"d":"$0"}},{"$f":"D9","v":{"v":0,"d":"$0"}},{"$f":"D9","v":{"v":0,"d":"$0"}},{"$f":"D9","v":{"v":0,"d":"$0"}},{"$f":"NPV('Penalty or Contribution Payment'!$C8,D9:H9)","v":{"v":0,"d":"$0"}}]
[1,null,"Total Future Income/Cash In",{"$nulls":5},{"$f":"SUM(I7:I9)","v":{"v":0,"d":"$0"}}]
["\"Future Income - one time cash flow\" - in some circumstances, in the near future, an individual may receive a one time, infrequent, or unexpected in nature income (cash) (e.g., insurance/litigation settlement).  "]
["\"Future Income - series of cash flows\" - in some circumstances, in the near future, an individual might receive a series of income/cash flows.  For example, an individual is expecting to receive payments from an annuity/mutual fund a year from now or any other future year.  "]
[null,null,"\"CASH OUT\"/(Cash Outflows)"]
[null,null,"Future Expenses - one time cash outflow                 (e.g., payment of a loan's principal)",{"v":0,"d":"$0"},{"v":0,"d":"$0"},{"v":0,"d":"$0"},{"v":0,"d":"$0"},{"v":0,"d":"$0"},{"$f":"NPV('Penalty or Contribution Payment'!$C8,D14:H14)","v":{"v":0,"d":"$0"}}]
[null,null,"Future Expenses - series of cash outflows          (e.g., medical expenses as a result of caring for an elderly parent)",{"v":0,"d":"$0"},{"v":0,"d":"$0"},{"v":0,"d":"$0"},{"v":0,"d":"$0"},{"v":0,"d":"$0"},{"$f":"NPV('Penalty or Contribution Payment'!$C8,D15:H15)","v":{"v":0,"d":"$0"}}]
[null,null,"Other Future Expenses - series of cash outlflows  (e.g., payments for a student loan in the next year(s) or future childcare expenses)",{"v":0,"d":"$0"},{"v":0,"d":"$0"},{"v":0,"d":"$0"},{"v":0,"d":"$0"},{"v":0,"d":"$0"},{"$f":"NPV('Penalty or Contribution Payment'!$C8,D16:H16)","v":{"v":0,"d":"$0"}}]
[2,null,"Total Future Expenses/Cash Out",{"$nulls":5},{"$f":"SUM(I14:I16)","v":{"v":0,"d":"$0"}}]
["FUTURE: CASH AVAILABLE (1 minus 2)",{"$nulls":7},{"$f":"I10-I17","v":{"v":0,"d":"$0"}}]

{"sheet":"Instructions Cash Flow","index":5,"n_rows":87,"n_cols":21,"rows_kept":87,"merged":[[0,0,0,18],[1,0,1,20],[2,0,2,18],[3,1,3,2],[3,3,3,18],[4,1,4,18],[5,1,5,2],[5,3,5,18],[6,1,6,2],[7,1,7,18],[8,1,8,2],[8,3,8,18],[9,3,9,18],[10,1,10,2],[10,3,10,18],[11,1,11,18],[12,1,12,18],[13,1,13,2],[13,3,13,18],[14,1,14,18],[15,1,15,2],[15,3,15,18],[16,1,16,18],[17,1,18,2],[17,4,18,18],[19,1,19,18],[20,1,20,2],[20,3,20,18],[21,1,21,18],[23,1,23,18],[24,0,25,2],[24,6,24,8],[24,12,24,16],[26,0,26,2],[27,1,27,2],[28,10,32,10],[28,18,32,18],[28,20,32,20],[35,10,50,10],[35,18,50,18],[35,20,50,20],[52,1,52,2],[52,12,52,16],[53,0,53,2],[54,1,54,2],[54,10,73,10],[54,18,73,18],[54,20,73,20],[75,1,75,2],[76,10,83,10],[76,18,83,18],[76,20,83,20],[85,1,85,2],[86,0,86,2]]}
["INSTRUCTIONS - CASH FLOW TEST"]
["User is advised but not required to obtain information/data on all assets and liabilities listed below.  To make a final determination on what information/data is needed is case specific.   "]
[]
[null,"INSTRUCTIONS:"]
[]
[null,"Where do I insert the data?"]
[{"$nulls":3},"White color columns/cells in the Cash Flow Test's worksheet are working columns/cells where the user should insert the data/information on the individual."]
[null,"Where do I NOT have to fill the data?"]
[]
[null,"Blue color cells in the Net worth Test's working sheet are auto-populating and auto-calculating cells.  ",null,"          Blue color cells in the Cash Flow Test's worksheet are auto-populating and auto-calculating cells."]
[]
[]
[null,"Where are the instructions to follow?"]
[{"$nulls":3},"Gray color columns are instructions for the user to follow."]
[null,"Where can I find the data?"]
[null,"ü",null,"Gray color boxes with the check mark mean the information is provided and/or available for that particular source."]
[null,"What changes do I have to consider/make?"]
[null,"Adjustments in Market Value (Tertiary Sources)*",null,null,"Assets and liabilities found in the Tertiary Source(s) should be adjusted to the current market value, as necessary, through the use of the tips provided in the Guide, Checklist, and Reference Manual.  If this valuation is impossible, obtain the value from the individual and/or insert the value that was found and include a footnote explaining the valuation for your record."]
[]
[]
{"$rows_left_out":68}
{"sheet":"Debt Capacity Test","index":6,"n_rows":41,"n_cols":15,"rows_kept":41,"merged":[[0,0,0,17],[1,0,1,2],[1,3,1,4],[1,9,1,13],[1,14,1,17],[3,4,3,5],[9,4,11,4],[18,4,18,5],[20,4,21,5],[22,4,22,5],[29,4,29,5],[30,4,30,5],[31,4,36,5],[38,0,38,1],[40,0,40,5]]}
["DEBT CAPACITY TEST (Autofill Worksheet)"]
["[ Individual's Name]",null,null,"[Prepared by]",null,"[Date]",{"$nulls":3},"[Prepared by]",{"$nulls":4},"[Date]"]
[]
["Annual Income (Take Home) ","Source: Cash Flow Test","Amount in $",null,"Debt to Income Ratio (Monthly)"]
[null,null,"Spouse"]
["Salary/Wages","Row 13",{"$f":"'Cash Flow Test'!S13","v":{"v":0,"d":"$0.00"}},null,"Monthly Debt Payment",{"$f":"C37","v":{"v":0,"d":"$0.00"}}]
["Social Security","Row 24",{"$f":"'Cash Flow Test'!S24","v":{"v":0,"d":"$0.00"}},null,"(divided by)"]
["Military Pay","Row 22",{"$f":"'Cash Flow Test'!S22","v":{"v":0,"d":"$0.00"}},null,"Monthly Income",{"$f":"C22","v":{"v":0,"d":"$0.00"}}]
["Pension /Retirement Income","Row  18",{"$f":"'Cash Flow Test'!S18","v":{"v":0,"d":"$0.00"}},null,"(Equals)"]
["Dividend and Investment Interest","Row 14",{"$f":"'Cash Flow Test'!S14","v":{"v":0,"d":"$0.00"}},null,"Debt Capacity (debt to income ratio)"]
["Income Alimony/Child Support","Row 15",{"$f":"'Cash Flow Test'!S15","v":{"v":0,"d":"$0.00"}},null,null,{"$f":"IF(F8,F6/F8,\"Input Needed\")","v":"Input Needed"}]
["Rental Income","Row 20",{"$f":"'Cash Flow Test'!S20","v":{"v":0,"d":"$0.00"}}]
["Unemployment Benefits","Row 23",{"$f":"'Cash Flow Test'!S23","v":{"v":0,"d":"$0.00"}}]
["Food Stamps","Row 25",{"$f":"'Cash Flow Test'!S25","v":{"v":0,"d":"$0.00"}}]
["Royalties","Row 26",{"$f":"'Cash Flow Test'!S26","v":{"v":0,"d":"$0.00"}}]
["Business Income (Draw)","Row 19",{"$f":"'Cash Flow Test'!S19","v":{"v":0,"d":"$0.00"}}]
["Other (farm income)","Row 21",{"$f":"'Cash Flow Test'!S21","v":{"v":0,"d":"$0.00"}}]
["Other (trust Income)","Row 17",{"$f":"'Cash Flow Test'!S17","v":{"v":0,"d":"$0.00"}}]
["Other (e.g., future expenses, settlement of owner's life insurance)","Row 27",{"$f":"'Cash Flow Test'!S27","v":{"v":0,"d":"$0.00"}},null,"INSTRUCTIONS:"]
["Capital gain or (loss)","Row 28",{"$f":"'Cash Flow Test'!S28","v":{"v":0,"d":"$0.00"}}]
{"$rows_left_out":22}
{"sheet":"Penalty or Contribution Payment","index":7,"n_rows":32,"n_cols":16,"rows_kept":32,"merged":[[0,0,0,4],[1,1,1,3],[2,0,2,4],[2,10,2,14],[2,15,2,18],[12,0,13,4],[20,0,20,4],[22,0,22,4],[23,0,23,4],[24,0,24,4],[25,0,25,4],[26,1,27,4],[28,0,28,4],[29,1,29,4],[30,0,30,4],[31,0,32,4],[33,2,33,17],[34,1,34,17]]}
["SUMMARY: PENALTY OR CONTRIBUTION PAYMENTS"]
["[ Individual's Name]","[Prepared by]",null,null,"[Date]"]
[{"$nulls":6},"[Date]",{"$nulls":3},"[Prepared by]",{"$nulls":4},"[Date]"]
[null,"Excel Function","Test A: Cash Flow","Test B: Debt Capacity","Test C:                                           Cash Flow + Debt Capacity"]
["Cash Flow: Averaged Net Cash Flow                                                       Debt Capacity: Total Average Annual Income","PMT",{"$f":"'Cash Flow Test'!S65","v":{"v":0,"d":"$0"}},{"$f":"IF('Debt Capacity Test'!F11<=36%,'Debt Capacity Test'!C39, IF('Debt Capacity Test'!F11>36%,\"0\"))","v":"0"}]
["Discount Rate (Nominal)*","Rate",{"v":0.095,"d":"9.5%"},{"v":0.095,"d":"9.5%"}]
["Inflation Rate",null,{"v":0.023,"d":"2.3%"},{"v":0.023,"d":"2.3%"}]
["Discount Rate (Real)",null,{"$f":"(1+C6)/(1+C7)-1","v":{"v":0.07038123167155441,"d":"7.0%"}},{"$f":"(1+D6)/(1+D7)-1","v":{"v":0.07038123167155441,"d":"7.0%"}}]
["Period (years)","nper",5,5]
["Future Value (Real)","FV ",{"$f":"-FV(C8,C9,C5)+'Future Cash'!I18","v":{"v":0,"d":"$0"}},{"$f":"-FV(D8,D9,D5)","v":{"v":0,"d":"$0"}},{"$f":"C10+D10","v":{"v":0,"d":"$0"}}]
["Contingency Allowance Cushion",null,{"v":0,"d":"0%"},{"$f":"C11","v":{"v":0,"d":"0%"}}]
["Future Value (Real) with Contingency Allowance",null,{"$f":"C10-(C10*C11)","v":{"v":0,"d":"$0"}},{"$f":"D10-(D10*D11)","v":{"v":0,"d":"$0"}},{"$f":"C12+D12","v":{"v":0,"d":"$0"}}]
["If the individual provided the assets and liabilities in nominal value, then insert the nominal present value below for further calculation. In the situation where the assets and liabilities were provided in real value, then insert the real present value below for further calculation.  If it is unknown in what value the assets and liabilities were provided, please assume that the data provided by the individual in the nominal value, which is common practice in banks and businesses."]
[]
["Future Value (Nominal or Real) to Be Used for Further Calculation ",null,{"$f":"C12","v":{"v":0,"d":"$0"}},{"$f":"D12","v":{"v":0,"d":"$0"}},{"$f":"C15+D15","v":{"v":0,"d":"$0"}}]
["Amount Sought of Penalty or Contribution (e.g., insert the amount of environmental liability owned by the individual) ",null,{"v":0,"d":"$0"},{"v":0,"d":"$0"},{"v":0,"d":"$0"}]
[]
["Affordable Penalty or Contribution",null,{"$f":"IF(C15>=C16,\"Yes\",\"No\")","v":"Yes"},{"$f":"IF(D15>=D16,\"Yes\",\"No\")","v":"Yes"},{"$f":"IF(E15>=E16,\"Yes\",\"No\")","v":"Yes"}]
[]
["Value of Affordable Penalty or Contribution",null,{"$f":"IF(C15=C16, C15, IF(C15>C16, C16, IF(C15<C16, C15)))","v":{"v":0,"d":"$0"}},{"$f":"IF(D15=D16, D15, IF(D15>D16, D16, IF(D15<D16, D15)))","v":{"v":0,"d":"$0"}},{"$f":"IF(E15=E16, E15, IF(E15>E16, E16, IF(E15<E16, E15)))","v":{"v":0,"d":"$0"}}]
{"$rows_left_out":13}
{"sheet":"Cushion","index":8,"n_rows":102,"n_cols":1,"rows_kept":102,"hidden":true}
["Contigency Allowance (aka Cushion)"]
[{"v":0,"d":"0%"}]
[{"v":0.01,"d":"1%"}]
[{"v":0.02,"d":"2%"}]
[{"v":0.03,"d":"3%"}]
[{"v":0.04,"d":"4%"}]
[{"v":0.05,"d":"5%"}]
[{"v":0.06,"d":"6%"}]
[{"v":0.07,"d":"7%"}]
[{"v":0.08,"d":"8%"}]
[{"v":0.09,"d":"9%"}]
[{"v":0.1,"d":"10%"}]
[{"v":0.11,"d":"11%"}]
[{"v":0.12,"d":"12%"}]
[{"v":0.13,"d":"13%"}]
[{"v":0.14,"d":"14%"}]
[{"v":0.15,"d":"15%"}]
[{"v":0.16,"d":"16%"}]
[{"v":0.17,"d":"17%"}]
[{"v":0.18,"d":"18%"}]
{"$rows_left_out":82}