{"text_format":"3","workbook":"xlsx","n_sheets":13,"sheets":["Introduction","Dropdowns","Template Instructions_Systems","Template Instructions_State","Classifying SLs","PWS Information","Inventory Methods","Inventory Summary","Detailed Inventory","Public Accessibility Doc.","State Checklist","Building Conditionals","Form Lists"],"not_rendered":{"images":13,"defined_names":7},"read":"whole","date_system":"1900"}

{"sheet":"Introduction","index":0,"n_rows":21,"n_cols":4,"rows_kept":21,"merged":[[5,1,5,3],[7,1,7,3],[8,1,8,2],[10,1,10,3],[12,1,14,1],[15,1,19,1]]}
[]
[]
[null,null,"Service Line Inventory Template"]
[null,null,"Date last updated: July 27, 2022"]
[]
[null,"What is the purpose of this template? \nThe purpose of this draft template is to help water systems and states comply with the service line inventory requirements of the January 15, 2021 Lead and Copper Rule Revisions (LCRR). This template supplements the draft EPA document, Guidance for Developing and Maintaining a Service Line Inventory (2022) by providing fillable forms and tables that water systems can use to document their methods, organize their inventory, submit the initial inventory and inventory updates to the state, and document how they are making the inventory publicly available. This template also provides a checklist for state review. Note that EPA does NOT require systems use this template for their inventory. Refer to EPA's 2022 Inventory Guidance for minimum LCRR inventory requirements, recommendations, and disclaimers. \n"]
[]
[null,"How is the template organized?"]
[null,"The worksheets in this template are color coded: \n          Yellow sheets are instructions and background.\n          Dark blue sheets are templates for systems.\n          The dark green sheet is a template for states.\n\nSee the table below for a description of each worksheet.\n ",null,"The cells in this template are also color coded:\n         Gray cells are background or instructions.\n         Light blue cells are fillable cells for systems.\n         Aqua cells are the required fields in the Detailed Inventory worksheet.\n         Light green cells are fillable cells for states."]
[]
[null,"Template Organization"]
[null,"Worksheet Type","Worksheet Name","Description"]
[null,"Background","Template Instructions_System","Contains detailed instructions for systems. "]
[null,null,"Template Instructions_States","Contains detailed instructions for states. "]
[null,null,"Classifying SLs","Summarizes requirements for classifying the entire service line when ownership is split (i.e., when the system owns a portion and the customer owns a portion)."]
{"$rows_left_out":7}
{"sheet":"Dropdowns","index":1,"n_rows":26,"n_cols":4,"rows_kept":26,"hidden":true}
[]
[null,"Drop down lists (Internal, DO NOT MODIFY)"]
[]
[null,"Ownership","Basis of materials classification","Field Verification Methods"]
[null,"Select Ownership Type","Previous Materials Evaluation","Customer self-identification"]
[null,"The entire service line is owned by the water system","Installation record (e.g., tap card)","CCTV investigation at curb stop - internal"]
[null,"The entire service line is owned by the customer","Installation date after lead ban","CCTV investigation at curb stop - external"]
[null,"Ownership is split, meaning that the system owns and portion and the customer owns a portion","Service line diameter is > 2 inches","Water quality sampling"]
[null,"Other","Service line repair or replacement record","Mechanical excavation at one location"]
[null,null,"Predictive model","Mechanical excavation at multiple locations"]
[null,null,"Water sampling only with no records","Visual inspection at the meter pit"]
[null,null,"Field inspection only with no records","Other"]
[null,null,"Other"]
[]
[null,"State review of customer notification of service line material"]
{"$rows_left_out":12}
{"sheet":"Template Instructions_Systems","index":2,"n_rows":0,"n_cols":0,"rows_kept":0}

{"sheet":"Template Instructions_State","index":3,"n_rows":0,"n_cols":0,"rows_kept":0}

{"sheet":"Classifying SLs","index":4,"n_rows":30,"n_cols":4,"rows_kept":30,"merged":[[1,1,1,3],[3,1,3,3],[5,1,5,3],[6,1,6,3],[8,1,8,3],[9,1,11,3],[12,1,12,3],[14,1,14,3],[29,1,29,3]]}
[]
[null,"Classifying the Entire Service Line When Ownership Is Split"]
[]
[null,"Purpose of this worksheet: To summarize EPA's requirements for classifying the entire service line when ownership is split."]
[]
[null,"Introduction"]
[null,"In many cases, service line ownership is split meaning that the system owns a portion and the customer owns a portion of the service line. Exhibit 1 below is a diagram of a possible division in service line ownership between the water system and customer. While the LCRR requires the inventory to categorize each service line or portions of the service line where ownership is split, a single classification per service line is also needed to support various LCRR requirements, such as lead service line replacement (LSLR), tap sampling, and risk mitigation. Table 1 below indicates how to classify the material for the entire service line when ownership is split between the water system and customer. For more information, see EPA's, Guidance for Developing and Maintaining a Service Line Inventory (2022)."]
[]
[null,"Exhibit 1. Example of Service Line Ownership Distinction between the Water System and Customer"]
[]
[]
[]
[null,"Source: Exhibit 2-2 of Guidance for Developing and Maintaining a Lead Service Line Inventory (USEPA, 2022)."]
[]
[null,"Table 1: Classification of Entire Service Line When Ownership is Split"]
{"$rows_left_out":16}
{"sheet":"PWS Information","index":5,"n_rows":25,"n_cols":5,"rows_kept":25,"merged":[[1,1,1,4],[2,1,2,4],[3,1,3,4],[5,1,5,4],[6,1,6,4],[7,1,7,4],[10,1,10,3],[11,1,11,4],[12,1,12,4],[13,1,13,4],[14,1,14,2],[15,1,15,2],[16,1,16,4],[17,1,17,2],[18,1,18,2],[18,3,18,4],[19,1,19,2],[20,1,20,2],[20,3,20,4],[21,1,21,4],[22,1,22,2],[23,1,23,2],[23,3,23,4],[24,1,24,2],[25,1,25,2],[25,3,25,4]]}
[]
[null,"PWS Information"]
[]
[null,"Purpose of this worksheet:  For water systems to document basic system information."]
[]
[null,"Facility Information"]
[null,"Water System Name:"]
[]
[null,"PWSID:","Population Served (number of people):","Number of Service Connections:","PWS Type:"]
[{"$nulls":4},"                CWS                    NTNCWS"]
[null,"If you are a CWS, do multi-family residences comprise at least 20% of the structures you serve?",null,null,"Select \"Yes\" or \"No\""]
[null,"Mailing Address"]
[null,"Street or P.O. Box:"]
[]
[null,"City or Town:",null,"State:","Zip Code:"]
{"$rows_left_out":11}
{"sheet":"Inventory Methods","index":6,"n_rows":46,"n_cols":4,"rows_kept":46,"merged":[[1,1,1,3],[2,1,2,3],[3,1,3,3],[4,2,4,3],[6,1,6,3],[8,1,8,3],[9,2,9,3],[10,2,10,3],[11,2,11,3],[12,2,12,3],[13,2,13,3],[14,2,14,3],[15,2,15,3],[17,1,17,3],[18,1,18,3],[24,1,24,3],[25,1,25,3],[26,1,26,2],[27,1,27,3],[28,1,28,3],[29,1,29,3],[30,1,30,3],[31,1,31,3],[36,5,37,13],[41,1,41,3],[42,1,42,3],[43,1,43,3],[44,1,44,3],[45,1,45,3],[46,1,46,3]]}
[]
[null,"Inventory Methodology"]
[null,{"$f":"IF('PWS Information'!$B$8=\"\",\"PWS Name:\", \"PWS Name: \"&'PWS Information'!B8)","v":"PWS Name:"}]
[null,{"$f":"IF('PWS Information'!$B$10=\"\",\"PWSID:\",\"PWSID: \"&'PWS Information'!$B$10)","v":"PWSID:"}]
[null,"Enter Date Last Updated:"]
[]
[null,"Purpose of this worksheet: For water systems to document the methods and resources they used to develop and update their inventory."]
[]
[null,"Part 1: Historical Records Review "]
[null,"Type of Record","Describe the Records Reviewed for Your Inventory and Indicate Your Level of Confidence (e.g., Low, Medium, or High) "]
[null,"1. Previous Materials Evaluation\nExample: Locations of Tier 1 lead tap sampling locations that are served by a lead service line."]
[null,"2. Construction Records and Plumbing Codes\nExamples: Local ordinance adopting an international plumbing code. Permits for replacing lead service lines."]
[null,"3. Water System Records\nExamples: Capital improvement plans. Standard operating procedures. Engineering standards."]
[null,"4. Distribution System Inspections and Records\nExamples: Distribution system maps. Tap cards. Service line repair/replacement records. Inspection records. Meter installation records. "]
[null,"5. Additional Records Required by Your State"]
{"$rows_left_out":32}
{"sheet":"Inventory Summary","index":7,"n_rows":37,"n_cols":5,"rows_kept":37,"merged":[[1,1,1,4],[2,1,2,4],[3,1,3,4],[4,2,4,4],[6,1,6,4],[8,1,8,4],[9,1,9,2],[9,3,9,4],[10,1,10,2],[10,3,10,4],[11,1,11,4],[12,1,12,2],[12,3,12,4],[13,1,13,4],[14,1,14,4],[15,1,15,4],[16,1,16,4],[17,1,17,4],[18,1,18,2],[18,3,18,4],[19,1,19,4],[20,1,20,4],[22,1,22,4],[23,1,23,4],[24,1,24,4],[26,1,26,4],[27,1,27,4],[28,2,28,3],[29,2,29,3],[30,2,30,3],[31,2,31,3],[32,2,32,3],[33,1,33,3],[35,1,35,4],[36,1,36,4]]}
[]
[null,"Inventory Summary"]
[null,{"$f":"IF('PWS Information'!$B$8=\"\",\"PWS Name:\", \"PWS Name: \"&'PWS Information'!B8)","v":"PWS Name:"}]
[null,{"$f":"IF('PWS Information'!$B$10=\"\",\"PWSID:\",\"PWSID: \"&'PWS Information'!$B$10)","v":"PWSID:"}]
[null,"Enter Date Last Updated:"]
[]
[null,"Purpose of this worksheet:  For water systems to provide a summary of their service line inventory, including information on ownership, inventory format, and the number of service lines for each of the four required materials classifications."]
[]
[null,"Part 1.  General Information"]
[null,"1. Is this the Initial Inventory or an Inventory Update?",null,"Select One"]
[null,"2a. Who owns the service lines in your system?  If other, please explain below.",null,"Select Ownership Type"]
[]
[null,"2b. Is there documentation that defines service line ownership in your system, such as a local ordinance? If yes, please describe below and explain where ownership is split (e.g., property line, curb stop).",null,"Select \"Yes\" or \"No\" "]
[]
[null,"3a. Describe when lead service lines were generally installed in your system."]
{"$rows_left_out":23}
{"sheet":"Detailed Inventory","index":8,"n_rows":20,"n_cols":33,"rows_kept":20,"merged":[[1,1,1,10],[2,1,2,10],[3,1,3,10],[4,1,4,4],[4,5,4,10],[4,16,4,18],[6,1,6,10],[8,1,8,5],[8,6,8,14],[8,15,8,22],[8,23,10,23],[8,24,8,26],[8,27,8,30],[8,31,8,32],[9,1,10,1],[9,2,9,3],[9,4,10,4],[9,5,10,5],[9,6,10,6],[9,7,10,7],[9,8,10,8],[9,9,10,9],[9,10,10,10],[9,11,10,11],[9,12,9,13],[9,14,10,14],[9,15,10,15],[9,16,10,16],[9,17,10,17],[9,18,10,18],[9,19,10,19],[9,20,9,21],[9,22,10,22],[9,24,10,24],[9,25,10,25],[9,26,10,26],[9,27,10,27],[9,28,10,28],[9,29,10,29],[9,30,10,30],[9,31,10,31],[9,32,10,32],[11,2,11,3],[11,27,11,30]]}
[]
[null,"Detailed Inventory"]
[null,{"$f":"IF('PWS Information'!$B$8=\"\",\"PWS Name:\", \"PWS Name: \"&'PWS Information'!B8)","v":"PWS Name:"}]
[null,{"$f":"IF('PWS Information'!$B$10=\"\",\"PWSID:\",\"PWSID: \"&'PWS Information'!$B$10)","v":"PWSID:"}]
[null,"Date Last Updated:"]
[]
[null,"Purpose of this worksheet: To provide a customizable format water systems can use to track materials for each service line in their distribution system. \n\nGeneral Instructions: Each row in this worksheet represents one service line connecting the water main to the customer's plumbing. The worksheet includes required and recommended elements; the columns with the aqua shading are required by the LCRR. Systems can customize by adding or deleting columns. Important notes for each column are in Row 12; also see the Template Instructions worksheet for detailed instructions. Note that users can freeze panes to enable them to see the headings and notes when entering data. The worksheet includes examples in rows 13 - 20 and is formatted for approximately 10,000 entries. ",{"$nulls":10}," ",{"$nulls":7}," "]
[]
[null,"Location Information",{"$nulls":4},"System-Owned Portion",{"$nulls":8},"Customer-Owned Portion",{"$nulls":7},"Entire Service Line\nMaterial Classification","Other Potential Sources of Lead",null,null,"Additional Information to Assign Tap Monitoring Tiering",{"$nulls":3},"Lead Service Line Replacement (LSLR)"]
[null,"Unique Service Line ID","Location Identifier ",null,"Sensitive Population? (Yes/No)","Disadvantaged Neighborhood? (Yes/No)","System-Owned Portion \nService Line Material Classification ","If Non-Lead in Column G,\nWas Material Ever Previously Lead?","Service Line Installation Date","Service Line Size","Basis of Material Classification","Was the Service Line Material Field Verified?","If \"Yes\" Service Line Material Was Field Verified:",null,"Notes","Customer-Owned Portion\nService Line Material Classification","Service Line Installation Date","Service Line Size","Basis of Material Classification","Was the Service Line Material Field Verified?","If \"Yes\" Service Line Material Was Field Verified:",null,"Notes",null,"Is there a Lead Connector?","Is there Lead Solder in the Service Line?","Describe Other Fittings and Equipment Connected to the Service Line that Contain Lead","Building Type Connected to Service Line","Point-of-Entry or Point-of-Use Treatment Present?","Does the Interior Building Plumbing Contain Copper Pipes with Lead Solder Installed Before Your State's Lead Ban (Generally 1986 - 1988)?"," Current LCR Sampling Site?","Date of System-owned LSLR","Date of Customer-owned LSLR"]
[null,null,"Street Address","Other Location Identifier",{"$nulls":8},"Describe the Field Verification Method","Enter the Date of Field Verification",{"$nulls":6},"Describe the Field Verification Method","Enter the Date of Field Verification"]
[null,"A Unique ID is recommended for each service line.","Water systems must track addresses of all service lines in their internal inventory. For the publicly accessible version, location identifiers are required for lead and galvanized requiring replacement. If the system does not use addresses for their location identifier, other options could include GPS coordinates, landmark, intersection, block, or other details to specify service line locations.",null,"Select Yes if sensitive subpopulation, e.g., day care, school, multifamily home. If Yes-Other, describe in the Notes field.","Does location meet state affordability guidelines or other measures?","Dropdown list includes recommended subclassifications. If \"Non-Lead Other\", describe in Notes field","Select Yes, No, or Don't know. Important for determining if downstream/ customer-owned galvanized service line requires replacement","Date, year, or estimated date range when the service line was installed or replaced","Diameter in inches","Select option from drop down list. If \"Other,\" describe in the Notes field","Select Yes or No","Select option from drop down list. If \"Other,\" describe in the Notes field","Enter approximate date of field verification or date that the record was updated","Can use this field for documenting additional relevant information, including when classification changes.","Dropdown list includes recommended subclassifications. If non-lead other, describe in Notes field.","Date, year, or estimated date range when the service line was installed or replaced","Diameter in inches","Select option from drop down list. If \"Other,\" describe in the Notes field","Select Yes or No","Select option from drop down list. If \"Other,\" describe in the Notes field","Enter approximate date of field verification or date that record was updated","Can use this field for documenting additional relevant information, including when classification changes.","Dropdown list includes four required service line classifications of Lead, Non-lead, Galvanized Requiring Replacement, or Unknown","For example, lead gooseneck or pigtail where the water main is connected to the service line","Select Yes, No, or Don't Know","For example, backflow preventer or meter containing lead","Note: This information may be helpful for identifying lead tap monitoring locations."]
[null,"Example 1","1234 Test St., City, State, Zip Code"," Intersection of Test and Elm St.","No","No","Non-Lead - Plastic","Yes",1997,2,"Installation date after lead ban","Yes","Visual inspection at the meter pit","2019-05-01",null,"Non-Lead - Plastic",2012,2,"Installation date after lead ban","No",{"$nulls":3},"Non-Lead","No","No",null,"Single Family Residence","Yes"," No","No"]
[null,"Example 2","4321 Test St., City, State, Zip Code","Intersection of Test and Main St.","No","No","Non-Lead - Plastic","No","Fall 1980",2,"Installation record (e.g., tap card)","Yes","Mechanical excavation at one location","2020-09-10",null,"Galvanized","Fall 1980",2,"Installation record (e.g., tap card)","Yes","Mechanical excavation at one location","2020-09-10",null,"Non-Lead","No","No",null,"Single Family Residence"," No","No","No"]
[null,"Example 3","16 Capital St., City, State, Zip Code",null,"No","No","Non-Lead - Copper","Don't know",1985,"1 1/2","Service line repair or replacement record","No",{"$nulls":3},"Galvanized",1908,"1 1/2","Installation record (e.g., tap card)","No",{"$nulls":3},"Galvanized Requiring Replacement","Don't Know","Don't Know",null,"Other","Unknown","Unknown","No"]
{"$rows_left_out":6}
{"sheet":"Public Accessibility Doc.","index":9,"n_rows":31,"n_cols":4,"rows_kept":31,"merged":[[1,1,1,3],[2,1,2,3],[3,1,3,3],[4,2,4,3],[6,1,6,3],[8,1,8,3],[16,1,16,3],[17,1,17,3],[18,1,18,2],[19,1,19,3],[20,1,20,3],[21,1,21,3],[30,1,30,3],[31,1,31,3]]}
[]
[null,"Public Accessibility Documentation"]
[null,{"$f":"IF('PWS Information'!$B$8=\"\",\"PWS Name: \",\"PWS Name: \"&'PWS Information'!B8)","v":"PWS Name: "}]
[null,{"$f":"IF('PWS Information'!$B$10=\"\",\"PWSID:\",\"PWSID: \"&'PWS Information'!$B$10)","v":"PWSID:"}]
[null,"Enter Date Last Updated:"]
[]
[null,"Purpose of this worksheet: For systems to provide documentation to states on how they met the public accessibility requirements of the LCRR. "]
[]
[null,"1. Select the location identifiers that you use for your service line inventory. Check all that apply."]
[null,"            Address"]
[null,"            Street"]
[null,"            Block"]
[null,"            Intersection"]
[null,"            Landmark"]
[null,"            GPS Coordinates"]
{"$rows_left_out":17}
{"sheet":"State Checklist","index":10,"n_rows":75,"n_cols":5,"rows_kept":75,"merged":[[1,1,1,4],[2,1,2,4],[3,1,3,4],[4,1,4,2],[4,3,4,4],[6,1,6,4],[8,1,8,4],[9,1,9,2],[10,1,10,2],[10,3,10,4],[11,1,11,2],[12,1,12,2],[12,3,12,4],[14,1,14,4],[15,1,15,3],[16,1,16,4],[18,1,18,4],[19,1,19,3],[20,1,20,4],[21,1,21,3],[22,1,22,4],[23,1,23,3],[24,1,24,4],[25,1,25,4],[26,1,26,4],[28,1,28,4],[29,1,29,3],[30,1,30,4],[31,1,31,3],[32,1,32,4],[33,1,33,3],[34,1,34,4],[35,1,35,4],[36,1,36,4],[38,1,38,4],[39,1,39,3],[40,1,40,4],[41,1,41,3],[42,1,42,4],[43,1,43,4],[44,1,44,4],[46,1,46,4],[47,0,48,0],[47,1,47,3],[47,4,48,4],[47,5,48,5],[48,1,48,3],[49,1,49,3],[50,1,50,3],[51,1,51,4],[52,0,59,0],[52,1,52,3],[52,4,59,4],[52,5,59,5],[53,1,53,3],[54,1,54,3],[55,1,55,3],[56,1,56,3],[57,1,57,3],[58,1,58,3],[59,1,59,3],[60,1,60,4],[61,0,65,0],[61,1,61,3],[61,4,65,4],[61,5,65,5],[62,1,62,3],[63,1,63,3],[64,1,64,3],[65,1,65,3],[66,1,66,4],[67,0,71,0],[67,1,67,3],[67,4,71,4],[67,5,71,5],[68,1,68,3],[69,1,69,3],[70,1,70,3],[71,1,71,3],[72,1,72,4],[73,1,73,3],[74,1,74,4],[75,1,75,4]]}
[]
[null,"State Checklist for Initial Inventory Submittal"]
[null,{"$f":"IF('PWS Information'!$B$8=\"\",\"PWS Name:\",\"PWS Name: \"&'PWS Information'!$B$8)","v":"PWS Name:"}]
[null,{"$f":"IF('PWS Information'!$B$10=\"\",\"PWSID: \",\"PWSID: \"&'PWS Information'!$B$10)","v":"PWSID: "}]
[null,"Enter Date Last Updated:"]
[]
[null,"Purpose of this worksheet: For states to determine and document if water systems met all of the January 15, 2021 Lead and Copper Rule (LCRR) requirements for their Initial Inventory including timely submission, required elements, use of information sources, public accessibility, and public notification of service line materials."]
[]
[null,"Part 1:  Person Completing This Checklist"]
[null,"Name:",null,"Title:"]
[]
[null,"Telephone:",null,"Email:"]
[]
[]
[null,"Part 2: Review for Timely Submission"]
{"$rows_left_out":61}
{"sheet":"Building Conditionals","index":11,"n_rows":40,"n_cols":23,"rows_kept":40,"hidden":true}
["DRAFT",{"$nulls":8},"Form Option For Customer Side","Classification",{"$nulls":4},"System-Owned Portion","Was Previously Lead?","Customer-Owned Portion","Classification for Entire Service Line ",null,null,"Single-Owned Portion","Classification for Entire Service Line "]
[null,"Note to EPA: This is a background sheet to be hidden or deleted",{"$nulls":7},"Lead","Lead",{"$nulls":4},"Lead",null,"Lead","Lead",null,null,"Lead","Lead"]
[{"$nulls":9},"Lead-lined galvanized","Lead",{"$nulls":4},"Lead",null,"Galvanized","Lead",null,null,"Galvanized","Non-Lead"]
[{"$nulls":9},"Galvanized","Galvanized",{"$nulls":4},"Lead",null,"Non-Lead","Lead",null,null,"Non-Lead","Non-Lead"]
[{"$nulls":9},"Non-Lead - Copper","Non-Lead",{"$nulls":4},"Lead",null,"Material Unknown","Lead",null,null,"Material Unknown","Lead Status Unknown"]
[{"$nulls":9},"Non-Lead - Plastic","Non-Lead",{"$nulls":4},"Galvanized",null,"Lead","Lead"]
[{"$nulls":9},"Non-Lead - Other","Non-Lead",{"$nulls":4},"Galvanized",null,"Galvanized","Non-Lead"]
[{"$nulls":9},"Unknown - Likely Lead","Material Unknown",{"$nulls":4},"Galvanized",null,"Non-Lead","Non-Lead"]
[{"$nulls":9},"Unknown - Unlikely Lead","Material Unknown",{"$nulls":4},"Galvanized",null,"Material Unknown","Lead Status Unknown"]
[{"$nulls":9},"Unknown - Material Unknown","Material Unknown",{"$nulls":4},"Non-Lead",null,"Lead","Lead"]
[{"$nulls":15},"Non-Lead","Y","Galvanized","Galvanized Requiring Replacement"]
[{"$nulls":9},"Form Option For System Side","Classification",{"$nulls":4},"Non-Lead","N","Galvanized","Non-Lead"]
[{"$nulls":9},"Lead","Lead",{"$nulls":4},"Non-Lead","DN","Galvanized","Galvanized Requiring Replacement"]
[{"$nulls":9},"Lead-lined galvanized","Lead",{"$nulls":4},"Non-Lead",null,"Non-Lead","Non-Lead"]
[{"$nulls":9},"Galvanized","Galvanized",{"$nulls":4},"Non-Lead",null,"Material Unknown","Lead Status Unknown"]
{"$rows_left_out":26}
{"sheet":"Form Lists","index":12,"n_rows":13,"n_cols":19,"rows_kept":13,"hidden":true}
["Tab","Form Control Lists"]
["Detailed Inventory","Sensitive Population? (Y/N)","Service Line Material Classification*","If Non-Lead,\nWas Material Ever Previously Lead?","Basis of Material Classification","Was the Service Line Material Field Verified?","Select the Field Verification Method","Building Type Connected to Service Line","For CWSs, do Multi-family Residences (MFRs) Comprise at Least 20% of the Structures You Serve?","Is there a Lead Connector Present?","Point-of-Entry or Point-of-Use Treatment Present?","Does the Interior Building Plumbing Contain Copper Pipes with Lead Solder Installed before your State's Lead Ban (Generally 1986 - 1988)"," Current LCR Sampling Site?","Building Type Connected to Service Line","For CWSs, do Multi-family Residences (MFRs) Comprise at Least 20% of the Structures You Serve?","Is there a Lead Connector Present?","Point-of-Entry or Point-of-Use Treatment Present?","Does the Interior Building Plumbing Contain Copper Pipes with Lead Solder Installed before your State's Lead Ban (Generally 1986 - 1988)"," Current LCR Sampling Site?"]
[null,"No","Lead","Yes","Previous materials evaluation","Yes","Visual inspection at meter pit","Single Family Residence","Yes","Yes","Yes","Yes","Yes","Single Family Residence","Yes","Yes","Yes","Yes","Yes"]
[null,"Yes - School","Lead-lined galvanized","No","Installation record (e.g., tap card)","No","Customer self-identification","Multiple Family Residence"," No","Known"," No"," No","No","Multiple Family Residence"," No","Known"," No"," No","No"]
[null,"Yes - Day Care","Galvanized","Don't know","Installation date is after the lead ban",null,"CCTV Inspection at Curb Box - Internal","Building","N/A","Unknown","Unknown","Unknown",null,"Building","N/A","Unknown","Unknown","Unknown"]
[null,"Yes - Other","Non-Lead - Copper",null,"Service line diameter is greater than 2 inches",null,"CCTV inspection at Curb Box - External","Other",{"$nulls":5},"Other"]
[null,null,"Non-Lead - Plastic",null,"Service line repair or replacement record",null,"Water Quality Sampling - Targeted"]
[null,null,"Non-Lead - Other",null,"Statistical analysis",null,"Water Quality Sampling - Flushed"]
[null,null,"Unknown - Likely Lead",null,"Field inspection only with no records",null,"Water Quality Sampling - Sequential"]
[null,null,"Unknown - Unlikely Lead",null,"Water sampling only with no records",null,"Water Quality Sampling - Other"]
[null,null,"Unknown - Material Unknown",null,"Other",null,"Mechanical Excavation at 1 location"]
[{"$nulls":6},"Mechanical Excavation at multiple locations"]
[null,"Note to EPA: this is a background sheet to be hidden or deleted",{"$nulls":3},"Other"]