{"text_format":"1","workbook":"xlsx","n_sheets":8,"sheets":["Instructions","Section 1","Section 2","Section 3","Section 4","Section 5","Reference List","Lists"],"not_rendered":{"charts":0,"images":0,"macros":1,"external_links":0,"defined_names":1,"comments":0,"pivot_tables":0},"unopened":[],"bounds":{"document_bytes":16777216,"sheet_cells":100000,"rows_first":2000,"rows_last":500,"rows_between":2000,"halvings":0,"cell_chars":16384,"cell_head_chars":4096},"cells_cut":0,"cells_raw":0,"read":"whole","date_system":"1900"}

{"sheet":"Instructions","index":0,"n_rows":19,"n_cols":3,"rows_kept":19,"cut":false,"hidden":false,"merged":[]}
[]
[null,null,"OMB Control Number: xxxx-xxxx"]
[null,null,"Expiration Date: xx/xx/xxxx"]
[null,null,"U.S. Environmental Protection Agency "]
[null,null,"Stratospheric Ozone Protection Program"]
[]
[null,null,"ODS Annual Emissions Report (Sec 82.25)"]
[null,null,"Version 1.0"]
[null,null,"Last Updated: November 2024"]
[]
[null,null,"Instructions"]
[null,null,"Complete and submit an ODS Annual Emissions Report if your company performs an activity listed under 40 CFR 82.25(a). Please provide information for only one facility per reporting form. "]
[null,null,"Complete this form by filling in the data fields that are highlighted in blue.  Guidance on how to complete individual data fields are provided in comment bubbles. Use the arrows to navigate between the tabs."]
[null,null,"Report Submission: This Excel file and all supporting attachments should be submitted to EPA through the Central Data Exchange (CDX) Other Documents submission flow. Refer to EPA's website for additional information on form submission:"]
[null,null,"https://www.epa.gov/ods-phaseout/ods-recordkeeping-and-reporting"]
[]
[null,null,"This collection of information is approved by OMB under the Paperwork Reduction Act, 44 U.S.C. 3501 et seq. (OMB Control No. XXXX-XXXX). Responses to this collection of information are mandatory (40 CFR 82.25). An agency may not conduct or sponsor, and a person is not required to respond to, a collection of information unless it displays a currently valid OMB control number. The number and expiration date are displayed in the upper right corner of the form. The public reporting and recordkeeping burden for this collection of information is estimated to be X hours per response. Send comments on the Agency’s need this formation, the accuracy of the provided burden estimates and any suggested methods for minimizing respondent burden including through the use of automated collection techniques to the Director, Regulatory Support Division, U.S. Environmental Protection Agency (2821T), 1200 Pennsylvania Ave., NW, Washington, D.C. 20460.  Include the OMB control number in any correspondence.  Do not send the completed form to this address."]
[]
[null,null,"EPA Form #xxxx-xxx"]

{"sheet":"Section 1","index":1,"n_rows":17,"n_cols":5,"rows_kept":17,"cut":false,"hidden":false,"merged":[[7,2,7,3]]}
[]
[null,null,"U.S. Environmental Protection Agency"]
[null,null,"ODS Annual Emissions Report"]
[]
[]
[]
[null,null,"Section 1: Report Identification Information "]
[null,null,"Complete all fields below for each facility that performs an activity listed under 40 CFR 82.25(a).  No fields may be left blank."]
[null,null,"Date Prepared:",null,{"$f":"IF(D9=0,1,0)","v":1}]
[null,null,"Company Name:",null,{"$f":"IF(D10=0,1,0)","v":1}]
[null,null,"Submission Type:",null,{"$f":"IF(D11=0,1,0)","v":1}]
[null,null,"Reporting Year:",null,{"$f":"IF(D12=0,1,0)","v":1}]
[null,null,"Facility Name: ",null,{"$f":"IF(D13=0,1,0)","v":1}]
[null,null,"Facility Street Address:",null,{"$f":"IF(D14=0,1,0)","v":1}]
[null,null,"Facility City:",null,{"$f":"IF(D15=0,1,0)","v":1}]
[null,null,"Facility State:",null,{"$f":"IF(D16=0,1,0)","v":1}]
[null,null,"Facility Zip Code:",null,{"$f":"IF(D17=0,1,0)","v":1}]

{"sheet":"Section 2","index":2,"n_rows":44,"n_cols":12,"rows_kept":44,"cut":false,"hidden":false,"merged":[[10,8,11,8],[20,6,20,7],[21,6,21,7],[22,6,22,7],[23,6,23,7],[18,6,18,7],[19,6,19,7],[27,6,27,7],[28,6,28,7],[29,6,29,7],[41,6,41,7],[40,6,40,7],[39,6,39,7],[33,6,33,7],[32,6,32,7],[31,6,31,7],[30,6,30,7],[38,6,38,7],[37,6,37,7],[36,6,36,7],[35,6,35,7],[34,6,34,7],[44,3,44,5],[44,9,44,10],[44,11,44,12],[10,7,11,7],[10,9,11,9],[17,11,17,12],[10,10,11,10],[10,5,11,5],[10,6,11,6],[10,3,11,3],[10,4,11,4],[42,6,42,7],[43,6,43,7],[24,6,24,7],[25,6,25,7],[26,6,26,7],[44,13,44,14],[19,11,19,12],[19,13,19,14],[43,11,43,12],[43,13,43,14],[10,11,10,12],[10,13,10,14],[17,13,17,14],[18,11,18,12],[18,13,18,14],[0,11,0,12],[0,13,0,14],[1,11,1,12],[1,13,1,14],[9,13,9,14],[2,11,2,12],[2,13,2,14],[3,11,3,12],[3,13,3,14],[4,11,4,12],[4,13,4,14],[9,3,9,10],[8,3,8,10],[5,11,5,12],[5,13,5,14],[6,11,6,12],[6,13,6,14],[7,11,7,12],[7,13,7,14],[8,11,8,12],[8,13,8,14],[9,11,9,12]]}
[]
[null,null,null,"U.S. Environmental Protection Agency"]
[null,null,null,{"$f":"'Section 1'!C3","v":"ODS Annual Emissions Report"}]
[]
[null,null,null,"Facility Name:",{"$f":"IF('Section 1'!$D$13=\"\",\"\",'Section 1'!$D$13)","v":""}]
[null,null,null,"Reporting Period:",{"$f":"IF('Section 1'!$D$12=\"\",\"\",'Section 1'!$D$12)","v":""}]
[]
[null,null,null,"Section 2: Process Information"]
[null,null,null,"For all facilities: Complete all fields below for each process listed in 82.25(b)(2) and associated process vents. No fields may be left blank. As part of your submission, please also provide the monitoring plan, as specified in 82.25(f)(6), including any revisions since the prior year’s submission, as applicable."]
[null,null,null,"If copying and pasting data into the table, please refer to the Reference List and the accompanying instructions."]
[null,null,null,null,"Process Identification\n82.25(e)(1)(ii)(A)","Process Description\n82.25(e)(1)(ii)(A)","Controlled Substance Used\n82.25(e)(1)(iii)","Method Used to Determine the Mass Emissions from Equipment Leaks Associated with the Process\n82.25(e)(1)(ii)(D)","Analytical Approach Used to Determine the Mass Emissions from Equipment Leaks Associated with the Process\n82.25(e)(1)(ii)(D)","Mass of Controlled Substance Emitted\n(kg)\n82.25(e)(1)(iii)","Effective Destruction Efficiency (DEeffective)\n82.25(e)(1)(iv)"]
[]
[null,null,null,"Process (1)",null,null,null,null,null,null,null,{"$f":"IF(E13=\"\",\"\",IF(COUNTBLANK(F13:K13)>0,\"ROW INCOMPLETE\",\"\"))","v":""}]
[null,null,null,"Process (2)",null,null,null,null,null,null,null,{"$f":"IF(E14=\"\",\"\",IF(COUNTBLANK(F14:K14)>0,\"ROW INCOMPLETE\",\"\"))","v":""}]
[null,null,null,"Process (3)",null,null,null,null,null,null,null,{"$f":"IF(E15=\"\",\"\",IF(COUNTBLANK(F15:K15)>0,\"ROW INCOMPLETE\",\"\"))","v":""}]
[null,null,null,"Process (4)",null,null,null,null,null,null,null,{"$f":"IF(E16=\"\",\"\",IF(COUNTBLANK(F16:K16)>0,\"ROW INCOMPLETE\",\"\"))","v":""}]
[null,null,null,"Process (5)",null,null,null,null,null,null,null,{"$f":"IF(E17=\"\",\"\",IF(COUNTBLANK(F17:K17)>0,\"ROW INCOMPLETE\",\"\"))","v":""}]
[]
[null,null,null,null,"Process Identification","Process Vent Identifier\n82.25(e)(1)(ii)(B)","Process Vent Description\n82.25(e)(1)(ii)(B)",null,"Method Used to Determine the Mass Emissions from Each Process Vent\n82.25(e)(1)(ii)(C)","Analytical Approach Used to Determine the Mass Emissions from Each Process Vent\n82.25(e)(1)(ii)(C)"]
[null,null,null,"Process Vent (1)",null,null,null,null,null,null,{"$f":"IF(E20=\"\",\"\",IF(COUNTBLANK(F20:J20)>0,\"ROW INCOMPLETE\",\"\"))","v":""}]
{"$rows_left_out":25}
{"sheet":"Section 3","index":3,"n_rows":38,"n_cols":14,"rows_kept":38,"cut":false,"hidden":false,"merged":[[10,13,10,14],[10,15,10,16],[38,3,38,5],[38,8,38,11],[38,13,38,14],[38,15,38,16],[8,13,8,14],[8,15,8,16],[9,3,9,11],[9,13,9,14],[9,15,9,16],[6,13,6,14],[6,15,6,16],[7,13,7,14],[7,15,7,16],[3,13,3,14],[3,15,3,16],[4,13,4,14],[4,15,4,16],[5,13,5,14],[5,15,5,16],[0,13,0,14],[0,15,0,16],[1,13,1,14],[1,15,1,16],[2,13,2,14],[2,15,2,16],[10,8,12,8],[10,9,12,9],[10,10,12,10],[10,12,12,12],[8,3,8,12],[10,6,12,6],[10,5,12,5],[10,4,12,4],[10,3,12,3],[10,7,12,7],[10,11,12,11]]}
[]
[null,null,null,"U.S. Environmental Protection Agency"]
[null,null,null,{"$f":"'Section 1'!C3","v":"ODS Annual Emissions Report"}]
[]
[null,null,null,"Facility Name:",{"$f":"IF('Section 1'!$D$13=\"\",\"\",'Section 1'!$D$13)","v":""}]
[null,null,null,"Reporting Period:",{"$f":"IF('Section 1'!$D$12=\"\",\"\",'Section 1'!$D$12)","v":""}]
[]
[null,null,null,"Section 3: Emission Factor and Emission Calculation Factor Approach"]
[null,null,null,"For processes whose emissions are determined using the emission factor approach under 82.25(c)(1)(iii) or the emission calculation factor under 82.25(c)(1)(iv): Complete all fields below for each process vent. No fields may be left blank."]
[null,null,null,"If copying and pasting data into the table, please refer to the Reference List and the accompanying instructions."]
[null,null,null,"Process Vent","Process Identification","Process Vent Identifier","Controlled Substance Used","Process Activity Used to Estimate Emissions\n82.25(e)(2)(i)","Quantity of Process Activity Used to Estimate Emissions\n(tons)\n82.25(e)(2)(i)","Emissions Estimate Approach Used\n82.25(e)(2)(ii)","Emission Factor or Emission Calculation Factor Used\n82.25(e)(2)(ii)","Mass of Controlled Substance Emitted\n(kg)\n82.25(e)(2)(iii)","Mass of Controlled Substance Emitted from Equipment Leaks\n(kg)\n82.25(e)(2)(iv)"]
[]
[]
[null,null,null,null,{"$f":"IF(D14=\"\",\"\",INDEX('Section 2'!$E$20:$E$44,MATCH(D14,'Section 2'!$D$20:$D$44,0)))","v":""},{"$f":"IF(D14=\"\",\"\",INDEX('Section 2'!$F$20:$F$44,MATCH(D14,'Section 2'!$D$20:$D$44,0)))","v":""},{"$f":"IF(D14=\"\",\"\",IF(E14=0,\"\",INDEX('Section 2'!$G$13:$G$17,MATCH('Section 3'!E14,'Section 2'!$D$13:$D$17,0))))","v":""},null,null,null,null,null,null,{"$f":"IF(E14=\"\",\"\",IF(COUNTBLANK(F14:M14)>0,\"ROW INCOMPLETE\",\"\"))","v":""}]
[null,null,null,null,{"$f":"IF(D15=\"\",\"\",INDEX('Section 2'!$E$20:$E$44,MATCH(D15,'Section 2'!$D$20:$D$44,0)))","v":""},{"$f":"IF(D15=\"\",\"\",INDEX('Section 2'!$F$20:$F$44,MATCH(D15,'Section 2'!$D$20:$D$44,0)))","v":""},{"$f":"IF(D15=\"\",\"\",IF(E15=0,\"\",INDEX('Section 2'!$G$13:$G$17,MATCH('Section 3'!E15,'Section 2'!$D$13:$D$17,0))))","v":""},null,null,null,null,null,null,""]
[null,null,null,null,{"$f":"IF(D16=\"\",\"\",INDEX('Section 2'!$E$20:$E$44,MATCH(D16,'Section 2'!$D$20:$D$44,0)))","v":""},{"$f":"IF(D16=\"\",\"\",INDEX('Section 2'!$F$20:$F$44,MATCH(D16,'Section 2'!$D$20:$D$44,0)))","v":""},{"$f":"IF(D16=\"\",\"\",IF(E16=0,\"\",INDEX('Section 2'!$G$13:$G$17,MATCH('Section 3'!E16,'Section 2'!$D$13:$D$17,0))))","v":""},null,null,null,null,null,null,""]
[null,null,null,null,{"$f":"IF(D17=\"\",\"\",INDEX('Section 2'!$E$20:$E$44,MATCH(D17,'Section 2'!$D$20:$D$44,0)))","v":""},{"$f":"IF(D17=\"\",\"\",INDEX('Section 2'!$F$20:$F$44,MATCH(D17,'Section 2'!$D$20:$D$44,0)))","v":""},{"$f":"IF(D17=\"\",\"\",IF(E17=0,\"\",INDEX('Section 2'!$G$13:$G$17,MATCH('Section 3'!E17,'Section 2'!$D$13:$D$17,0))))","v":""},null,null,null,null,null,null,""]
[null,null,null,null,{"$f":"IF(D18=\"\",\"\",INDEX('Section 2'!$E$20:$E$44,MATCH(D18,'Section 2'!$D$20:$D$44,0)))","v":""},{"$f":"IF(D18=\"\",\"\",INDEX('Section 2'!$F$20:$F$44,MATCH(D18,'Section 2'!$D$20:$D$44,0)))","v":""},{"$f":"IF(D18=\"\",\"\",IF(E18=0,\"\",INDEX('Section 2'!$G$13:$G$17,MATCH('Section 3'!E18,'Section 2'!$D$13:$D$17,0))))","v":""},null,null,null,null,null,null,""]
[null,null,null,null,{"$f":"IF(D19=\"\",\"\",INDEX('Section 2'!$E$20:$E$44,MATCH(D19,'Section 2'!$D$20:$D$44,0)))","v":""},{"$f":"IF(D19=\"\",\"\",INDEX('Section 2'!$F$20:$F$44,MATCH(D19,'Section 2'!$D$20:$D$44,0)))","v":""},{"$f":"IF(D19=\"\",\"\",IF(E19=0,\"\",INDEX('Section 2'!$G$13:$G$17,MATCH('Section 3'!E19,'Section 2'!$D$13:$D$17,0))))","v":""},null,null,null,null,null,null,""]
[null,null,null,null,{"$f":"IF(D20=\"\",\"\",INDEX('Section 2'!$E$20:$E$44,MATCH(D20,'Section 2'!$D$20:$D$44,0)))","v":""},{"$f":"IF(D20=\"\",\"\",INDEX('Section 2'!$F$20:$F$44,MATCH(D20,'Section 2'!$D$20:$D$44,0)))","v":""},{"$f":"IF(D20=\"\",\"\",IF(E20=0,\"\",INDEX('Section 2'!$G$13:$G$17,MATCH('Section 3'!E20,'Section 2'!$D$13:$D$17,0))))","v":""},null,null,null,null,null,null,""]
{"$rows_left_out":19}
{"sheet":"Section 4","index":4,"n_rows":18,"n_cols":25,"rows_kept":18,"cut":false,"hidden":false,"merged":[[8,3,8,23],[9,3,9,13],[10,13,12,13],[11,12,12,12],[11,11,12,11],[11,9,12,9],[11,7,12,7],[11,8,12,8],[10,7,10,9],[11,10,12,10],[10,10,10,12],[10,14,10,21],[18,3,18,5],[10,4,12,4],[10,25,10,26],[10,3,12,3],[10,5,12,5],[10,6,12,6],[10,22,11,23],[11,14,11,18],[11,19,11,21]]}
[]
[null,null,null,"U.S. Environmental Protection Agency"]
[null,null,null,{"$f":"'Section 1'!C3","v":"ODS Annual Emissions Report"}]
[]
[null,null,null,"Facility Name:",{"$f":"IF('Section 1'!$D$13=\"\",\"\",'Section 1'!$D$13)","v":""}]
[null,null,null,"Reporting Period:",{"$f":"IF('Section 1'!$D$12=\"\",\"\",'Section 1'!$D$12)","v":""}]
[]
[null,null,null,"Section 4: Mass Balance Approach"]
[null,null,null,"For processes whose emissions are determined using the mass balance approach under 82.25(c)(4): Complete all fields below for each process. No fields may be left blank. Enter \"N/A\" if the field is not applicable. If you use an element other than a halogen in the mass-balance equation, substitute that element for the halogen when completing these fields."]
[null,null,null,"As part of your submission, please provide supporting documentation that includes the data used to calculate relative and absolute errors under 82.25(c)(4)(i), including quantities and their accuracies and precisions."]
[null,null,null,"Process Identification","Controlled Substance Used","Relative Error\n(%)\n82.25(e)(3)(i)","Absolute Error\n(MT)\n82.25(e)(3)(i)","Reactant",null,null,"Product",null,null,"Method Used to Estimate Total Mass of Halogen in Destroyed or Recaptured Streams\n82.25(e)(3)(xiii)","Method used to estimate total mass of halogen in destroyed or recaptured streams",null,null,null,null,null,null,null,"Mass fraction of emissions consisting of halogen-containing:"]
[null,null,null,null,null,null,null,"Chemical Formula of Reactant\n82.25(e)(3)(vi)","Mass of Reactant Fed Into Process\n(kg)\n82.25(e)(3)(vi)","Mass of Reactant Emitted\n(kg)\n82.25(e)(3)(iii)","Chemical Formula of Product\n82.25(e)(3)(iv)","Mass of Product Produced by Process\n(kg)\n82.25(e)(3)(viii)","Mass of Product Emitted\n(kg)\n82.25(e)(3)(iv)",null,"82.25(c)(4)(iv)",null,null,null,null,"82.25(c)(4)(xv)"]
[null,null,null,null,null,null,null,null,null,null,null,null,null,null,"Chemical Formula of Reactant Fed into Destruction Device\n82.25(e)(3)(viii)","Mass of Reactant Fed into Destruction Device\n(MT)\n82.25(e)(3)(viii)","Chemical Formula of Product Fed into Destruction Device\n82.25(e)(3)(viii)","Mass of Product Fed into Destruction Device\n(MT)\n82.25(e)(3)(viii)","Demonstrated Destruction Efficiency (fraction)\n82.25(e)(3)(viii)","Total Mass of Halogen Fed into Destruction Device\n(MT)\n82.25(e)(3)(ix)","Mass of Recaptured Halogen\n(MT)\n82.25(e)(3)(ix)","Weighted Average Destruction Efficiency (fraction)\n82.25(e)(3)(ix)","Reactant\n82.25(e)(3)(x)","Product\n82.25(e)(3)(xi)"]
[null,null,null,null,{"$f":"IF(D14=\"\",\"\",INDEX('Section 2'!$G$13:$G$17,MATCH('Section 4'!D14,'Section 2'!$D$13:$D$17,0)))","v":""},null,null,null,null,null,null,null,null,null,null,null,null,null,null,null,null,null,null,null,{"$f":"IF(D14=\"\",\"\",IF(COUNTBLANK(E14:X14)>0,\"ROW INCOMPLETE\",\"\"))","v":""}]
[null,null,null,null,{"$f":"IF(D15=\"\",\"\",INDEX('Section 2'!$G$13:$G$17,MATCH('Section 4'!D15,'Section 2'!$D$13:$D$17,0)))","v":""},null,null,null,null,null,null,null,null,null,null,null,null,null,null,null,null,null,null,null,{"$f":"IF(D15=\"\",\"\",IF(COUNTBLANK(E15:X15)>0,\"ROW INCOMPLETE\",\"\"))","v":""}]
[null,null,null,null,{"$f":"IF(D16=\"\",\"\",INDEX('Section 2'!$G$13:$G$17,MATCH('Section 4'!D16,'Section 2'!$D$13:$D$17,0)))","v":""},null,null,null,null,null,null,null,null,null,null,null,null,null,null,null,null,null,null,null,{"$f":"IF(D16=\"\",\"\",IF(COUNTBLANK(E16:X16)>0,\"ROW INCOMPLETE\",\"\"))","v":""}]
[null,null,null,null,{"$f":"IF(D17=\"\",\"\",INDEX('Section 2'!$G$13:$G$17,MATCH('Section 4'!D17,'Section 2'!$D$13:$D$17,0)))","v":""},null,null,null,null,null,null,null,null,null,null,null,null,null,null,null,null,null,null,null,{"$f":"IF(D17=\"\",\"\",IF(COUNTBLANK(E17:X17)>0,\"ROW INCOMPLETE\",\"\"))","v":""}]
[null,null,null,null,{"$f":"IF(D18=\"\",\"\",INDEX('Section 2'!$G$13:$G$17,MATCH('Section 4'!D18,'Section 2'!$D$13:$D$17,0)))","v":""},null,null,null,null,null,null,null,null,null,null,null,null,null,null,null,null,null,null,null,{"$f":"IF(D18=\"\",\"\",IF(COUNTBLANK(E18:X18)>0,\"ROW INCOMPLETE\",\"\"))","v":""}]

{"sheet":"Section 5","index":5,"n_rows":16,"n_cols":8,"rows_kept":16,"cut":false,"hidden":false,"merged":[[10,9,10,10],[16,3,16,5],[16,7,16,8],[16,9,16,10],[10,3,12,3],[10,4,12,4],[10,5,12,5],[10,6,12,6],[10,7,10,8],[8,3,8,6],[8,7,8,8],[8,9,8,10],[9,3,9,6],[9,7,9,8],[9,9,9,10],[6,7,6,8],[6,9,6,10],[7,7,7,8],[7,9,7,10],[3,7,3,8],[3,9,3,10],[4,7,4,8],[4,9,4,10],[5,7,5,8],[5,9,5,10],[0,7,0,8],[0,9,0,10],[1,7,1,8],[1,9,1,10],[2,7,2,8],[2,9,2,10]]}
[]
[null,null,null,"U.S. Environmental Protection Agency"]
[null,null,null,{"$f":"'Section 1'!C3","v":"ODS Annual Emissions Report"}]
[]
[null,null,null,"Facility Name:",{"$f":"IF('Section 1'!$D$13=\"\",\"\",'Section 1'!$D$13)","v":""}]
[null,null,null,"Reporting Period:",{"$f":"IF('Section 1'!$D$12=\"\",\"\",'Section 1'!$D$12)","v":""}]
[]
[null,null,null,"Section 5: Destruction and Destruction Unit Excess Emissions"]
[null,null,null,"For facilities that destroy controlled substances: Complete all fields below for each destruction unit. No fields may be left blank."]
[null,null,null,"If copying and pasting data into the table, please refer to the Reference List and the accompanying instructions."]
[null,null,null,null,"Previously Produced Controlled Substance Destroyed\n82.25(e)(5)","Mass of Controlled Substance Emitted\n(kg)\n82.25(e)(5)(i)","Mass of Excess Controlled Substance Emitted due to Destruction Unit Malfunctions\n(kg)\n82.25(e)(4)"]
[]
[]
[null,null,null,"Destruction Unit (1)",null,null,null,{"$f":"IF(E14=\"\",\"\",IF(COUNTBLANK(F14:G14)>0,\"ROW INCOMPLETE\",\"\"))","v":""}]
[null,null,null,"Destruction Unit (2)",null,null,null,{"$f":"IF(E15=\"\",\"\",IF(COUNTBLANK(F15:G15)>0,\"ROW INCOMPLETE\",\"\"))","v":""}]
[null,null,null,"Destruction Unit (3)",null,null,null,{"$f":"IF(E16=\"\",\"\",IF(COUNTBLANK(F16:G16)>0,\"ROW INCOMPLETE\",\"\"))","v":""}]

{"sheet":"Reference List","index":6,"n_rows":24,"n_cols":7,"rows_kept":24,"cut":false,"hidden":false,"merged":[[5,2,5,6],[7,2,7,6],[8,2,8,6],[14,2,14,6]]}
[]
[null,null,"U.S. Environmental Protection Agency"]
[null,null,{"$f":"'Section 1'!C3","v":"ODS Annual Emissions Report"}]
[null,null,"Reference List"]
[]
[null,null,"Chemical Name List: The table below lists the valid chemical names that may be used when entering data into Section 2, Section 3, and Section 5 of this form. "]
[]
[null,null,"Chemical Name"]
[null,null,"Class I ODS"]
[null,null,"CFC-12","CFC-114","CFC-214","Halon 1211","CH3CCL3"]
[null,null,"CFC-13","CFC-115","CFC-215","Halon 1301","HBFCs"]
[null,null,"CFC-111","CFC-211","CFC-216","Halon 2402"]
[null,null,"CFC-112","CFC-212","CFC-217","CBM"]
[null,null,"CFC-113","CFC-213","Halon 1202","CCL4"]
[null,null,"Class II ODS"]
[null,null,"HCFC-21","HCFC-124a","HCFC-142b","HCFC-231","HCFC-251"]
[null,null,"HCFC-22","HCFC-131","HCFC-151","HCFC-232","HCFC-252"]
[null,null,"HCFC-31","HCFC-132b","HCFC-221","HCFC-233","HCFC-253"]
[null,null,"HCFC-121","HCFC-133a","HCFC-222","HCFC-234","HCFC-261"]
[null,null,"HCFC-122","HCFC-141","HCFC-223","HCFC-235","HCFC-262"]
{"$rows_left_out":5}
{"sheet":"Lists","index":7,"n_rows":66,"n_cols":9,"rows_kept":66,"cut":false,"hidden":true,"merged":[]}
[]
[null,"Chemical Name","Submission Type","Reporting Year","Current Year","Method used to determine mass of emissions","Process activity used to estimate emissions","Process identification","States"]
[null,"CFC-12","Original Submission",2024,{"$f":"YEAR(TODAY())","v":2024},"Process vent-specific emission factor","Product produced","Process agent use","Alaska"]
[null,"CFC-13","Re-Submittal",2025,null,"Process vent-specific emission calculation factor","Reactant consumed","Separation for reuse or recycling","Alabama"]
[null,"CFC-111",null,2026,null,"Mass balance approach",null,"Transformation of controlled substance produced at reporting facility","Arkansas"]
[null,"CFC-112",null,2027,null,null,null,"Transformation of controlled substance produced at another facility","Arizona"]
[null,"CFC-113",null,2028,null,null,null,"Destruction","California"]
[null,"CFC-114",null,2029,null,null,null,null,"Colorado"]
[null,"CFC-115",null,2030,null,null,null,null,"Connecticut"]
[null,"CFC-211",null,2031,null,null,null,null,"District of Columbia"]
[null,"CFC-212",null,2032,null,null,null,null,"Delaware"]
[null,"CFC-213",null,2033,null,null,null,null,"Florida"]
[null,"CFC-214",null,2034,null,null,null,null,"Georgia"]
[null,"CFC-215",null,2035,null,null,null,null,"Hawaii"]
[null,"CFC-216",null,null,null,null,null,null,"Iowa"]
[null,"CFC-217",null,null,null,null,null,null,"Idaho"]
[null,"Halon 1202",null,null,null,null,null,null,"Illinois"]
[null,"Halon 1211",null,null,null,null,null,null,"Indiana"]
[null,"Halon 1301",null,null,null,null,null,null,"Kansas"]
[null,"Halon 2402",null,null,null,null,null,null,"Kentucky"]
{"$rows_left_out":46}